{"text_format":"3","workbook":"xlsx","n_sheets":44,"sheets":["Student Page","Home","Instructions","Dues","Interview","Event35","Event34","Event33","Event32","Event31","Event30","Event29","Event28","Event27","Event26","Event25","Event24","Event23","Event22","Event21","Event20","Event19","Event18","Event17","Event16","Event15","Event14","Event13","Event12","Event11","Event10","Event9","Event8","Event7","Event6","Event5","Event4","Event3","Event2","Event1","Major Forum Roster","Due Raw","Dues Look-Up table","Mock Interview Raw Data"],"not_rendered":{"macros":1,"defined_names":4},"read":"whole","date_system":"1900"}

{"sheet":"Student Page","index":0,"n_rows":6,"n_cols":2,"rows_kept":6,"merged":[[0,1,0,2],[1,0,1,2],[2,1,2,2],[3,1,3,2],[4,1,4,2],[5,1,5,2],[6,1,6,2]]}
["Points as of: ",{"$f":"Home!C1","v":"2020-02-08"}]
["Enter your ID (ex. abc1234) to check your points"]
["ID","nmd5348"]
["Points",{"$f":"VLOOKUP(B3, Home!$D:$E, 2, FALSE)","v":8}]
["Dues",{"$f":"IFERROR(IF(VLOOKUP(B3, Home!D:F, 3, FALSE) = B3, \"YES\", \"NO\"), \"NO\")","v":"YES"}]
["Next Steps",{"$f":"IF(OR(MONTH(B1)=8, AND(MONTH(B1)=9, DAY(B1)<=17)),\nIF(AND(B4>=2, B5<>\"No\",#REF!<> \"No\"), Instructions!A11, IF(B4<2, Instructions!A6, \"\") & IF(B5=\"No\", Instructions!B6, \"\") & IF(#REF!=\"No\", Instructions!C6, \"\") & Instructions!D6),\nIF(OR(B4<2, B5=\"No\"), IF(B4<2, Instructions!A7, \"\") & IF(B5=\"No\", Instructions!B7, \"\") &  Instructions!D7,\nIF(B4<5, Instructions!A8 & Instructions!D8, IF(B4<10, Instructions!A9 & Instructions!D9, Instructions!A11))))","v":"Reach 10 points, allowing you to receive special recognition in resume book"}]

{"sheet":"Home","index":1,"n_rows":210,"n_cols":7,"rows_kept":210,"hidden":true}
["Points Updated as of: ",null,"2020-02-08"]
["Number of events:",null,35]
["Total Members:",null,{"$f":"COUNTA(D8:D999)","v":202}]
[]
[]
[]
["First","Last","Year","ID","Total","Dues","Mock Interview"]
["Chaoyi","Zhu","Sr","cxz94",{"$f":"COUNTIF(Event1!$D:$D, D8) + COUNTIF(Event2!$D:$D, D8) + COUNTIF(Event3!$D:$D, D8) + COUNTIF(Event4!$D:$D, D8) + COUNTIF(Event5!$D:$D, D8) + COUNTIF(Event6!$D:$D, D8) + COUNTIF(Event7!$D:$D, D8) + COUNTIF(Event8!$D:$D, D8) + COUNTIF(Event9!$D:$D, D8) + COUNTIF(Event10!$D:$D, D8) + COUNTIF(Event11!$D:$D, D8) + COUNTIF(Event12!$D:$D, D8) + COUNTIF(Event13!$D:$D, D8) + COUNTIF(Event14!$D:$D, D8) + COUNTIF(Event15!$D:$D, D8) + COUNTIF(Event16!$D:$D, D8) + COUNTIF(Event17!$D:$D, D8) + COUNTIF(Event18!$D:$D, D8) + COUNTIF(Event19!$D:$D, D8) + COUNTIF(Event20!$D:$D, D8) + COUNTIF(Event21!$D:$D, D8) + COUNTIF(Event22!$D:$D, D8) + COUNTIF(Event23!$D:$D, D8) + COUNTIF(Event24!$D:$D, D8) + COUNTIF(Event25!$D:$D, D8) + COUNTIF(Event26!$D:$D, D8) + COUNTIF(Event27!$D:$D, D8) + COUNTIF(Event28!$D:$D, D8) + COUNTIF(Event29!$D:$D, D8) + COUNTIF(Event30!$D:$D, D8) + COUNTIF(Event31!$D:$D, D8) + COUNTIF(Event32!$D:$D, D8) + COUNTIF(Event33!$D:$D, D8) + COUNTIF(Event34!$D:$D, D8) + COUNTIF(Event35!$D:$D, D8) + 0","v":10},{"$f":"INDEX(Dues!$D$6:$D$1000,MATCH(Home!$D8,Dues!$D$6:$D$1000, 0),)","v":"cxz94"}]
["Letitia obiero","Obiero","Fr","luo114",{"$f":"COUNTIF(Event1!$D:$D, D9) + COUNTIF(Event2!$D:$D, D9) + COUNTIF(Event3!$D:$D, D9) + COUNTIF(Event4!$D:$D, D9) + COUNTIF(Event5!$D:$D, D9) + COUNTIF(Event6!$D:$D, D9) + COUNTIF(Event7!$D:$D, D9) + COUNTIF(Event8!$D:$D, D9) + COUNTIF(Event9!$D:$D, D9) + COUNTIF(Event10!$D:$D, D9) + COUNTIF(Event11!$D:$D, D9) + COUNTIF(Event12!$D:$D, D9) + COUNTIF(Event13!$D:$D, D9) + COUNTIF(Event14!$D:$D, D9) + COUNTIF(Event15!$D:$D, D9) + COUNTIF(Event16!$D:$D, D9) + COUNTIF(Event17!$D:$D, D9) + COUNTIF(Event18!$D:$D, D9) + COUNTIF(Event19!$D:$D, D9) + COUNTIF(Event20!$D:$D, D9) + COUNTIF(Event21!$D:$D, D9) + COUNTIF(Event22!$D:$D, D9) + COUNTIF(Event23!$D:$D, D9) + COUNTIF(Event24!$D:$D, D9) + COUNTIF(Event25!$D:$D, D9) + COUNTIF(Event26!$D:$D, D9) + COUNTIF(Event27!$D:$D, D9) + COUNTIF(Event28!$D:$D, D9) + COUNTIF(Event29!$D:$D, D9) + COUNTIF(Event30!$D:$D, D9) + COUNTIF(Event31!$D:$D, D9) + COUNTIF(Event32!$D:$D, D9) + COUNTIF(Event33!$D:$D, D9) + COUNTIF(Event34!$D:$D, D9) + COUNTIF(Event35!$D:$D, D9) + 0","v":3},{"$f":"INDEX(Dues!$D$6:$D$1000,MATCH(Home!$D9,Dues!$D$6:$D$1000, 0),)","v":"luo114"}]
["Nick","Sawtelle","Fr","nus721",{"$f":"COUNTIF(Event1!$D:$D, D10) + COUNTIF(Event2!$D:$D, D10) + COUNTIF(Event3!$D:$D, D10) + COUNTIF(Event4!$D:$D, D10) + COUNTIF(Event5!$D:$D, D10) + COUNTIF(Event6!$D:$D, D10) + COUNTIF(Event7!$D:$D, D10) + COUNTIF(Event8!$D:$D, D10) + COUNTIF(Event9!$D:$D, D10) + COUNTIF(Event10!$D:$D, D10) + COUNTIF(Event11!$D:$D, D10) + COUNTIF(Event12!$D:$D, D10) + COUNTIF(Event13!$D:$D, D10) + COUNTIF(Event14!$D:$D, D10) + COUNTIF(Event15!$D:$D, D10) + COUNTIF(Event16!$D:$D, D10) + COUNTIF(Event17!$D:$D, D10) + COUNTIF(Event18!$D:$D, D10) + COUNTIF(Event19!$D:$D, D10) + COUNTIF(Event20!$D:$D, D10) + COUNTIF(Event21!$D:$D, D10) + COUNTIF(Event22!$D:$D, D10) + COUNTIF(Event23!$D:$D, D10) + COUNTIF(Event24!$D:$D, D10) + COUNTIF(Event25!$D:$D, D10) + COUNTIF(Event26!$D:$D, D10) + COUNTIF(Event27!$D:$D, D10) + COUNTIF(Event28!$D:$D, D10) + COUNTIF(Event29!$D:$D, D10) + COUNTIF(Event30!$D:$D, D10) + COUNTIF(Event31!$D:$D, D10) + COUNTIF(Event32!$D:$D, D10) + COUNTIF(Event33!$D:$D, D10) + COUNTIF(Event34!$D:$D, D10) + COUNTIF(Event35!$D:$D, D10) + 0","v":2},{"$f":"INDEX(Dues!$D$6:$D$1000,MATCH(Home!$D10,Dues!$D$6:$D$1000, 0),)","v":{"$error":"#N/A"}}]
{"$rows_left_out":201}
{"sheet":"Instructions","index":2,"n_rows":11,"n_cols":4,"rows_kept":11,"hidden":true,"merged":[[1,0,1,12]]}
["Operation instructions:"]
["- Enter new events on new sheets.  Make a new sheet by copying an old sheet and renaming it Eventx, where x is the next sequential event number.\n- Specify each event's name and date.  Attendance will autofill.\n- Check that no one entered their full email address in the ID field.  Also check that class standings are all in the correct abbreviations.\n- Before updating points, make sure to enter the date you are updating and the total number of events that are being counted in the yellow area at the top.                                                                                                                                                                                                                               -A common error occurs when someone submits an attendance sheet but uses an incorrect manual counting of attendance rather than the formula, resulting in more people being counted for attendance than signed in.  If the 'Home' tab seems to go haywire and add a lot of extra rows when the points macro runs, this is likely the cause of the issue."]
[]
[]
["Levels"]
["Reach 2 points, ","Pay dues, ",null,"and do this by the career fair to be in October resume book and be considered club member"]
["Reach 2 points, ","Pay dues, ",null,"and as soon as you do you can be in the resume book and be considered a club member"]
["Reach 5 points, ","Pay dues, ",null,"allowing you to be in resume book in Fall 2020 (you're eligible for the resume book until then)"]
["Reach 10 points, ","Pay dues, ",null,"allowing you to receive special recognition in resume book"]
[]
{"$rows_left_out":2}
{"sheet":"Dues","index":3,"n_rows":643,"n_cols":6,"rows_kept":643,"hidden":true}
["Event: ","Dues"]
["Date:","2019-12-05","<- Date last updated"]
["Attendance:",{"$f":"COUNTA(D6:D499)","v":146}]
[]
["First","Last","Year","ID"]
["Allen","Kody","kla5319","kla5319",{"$f":"D6","v":"kla5319"},{"$f":"IF(E6=\"\",\"NO\",\"YES\")","v":"YES"}]
["Andrian","Kevin","kas7146","kas7146",{"$f":"D7","v":"kas7146"},{"$f":"IF(E7=\"\",\"NO\",\"YES\")","v":"YES"}]
["Arena","Alex","afa5399","afa5399","afa5399","YES"]
["Asprer","Jared","jza5506","jza5506","jza5506","YES"]
["Barratt","Geoffrey","gxb92","gxb92","gxb92","YES"]
{"$rows_left_out":173}
{"sheet":"Interview","index":4,"n_rows":5,"n_cols":4,"rows_kept":5,"hidden":true}
["Event: ","Mock Interview"]
["Date:","2018-09-03"]
["Attendance:",{"$f":"COUNTA(D6:D206)","v":0}]
[]
["First","Last","Year","ID"]

{"sheet":"Event35","index":5,"n_rows":11,"n_cols":4,"rows_kept":11,"hidden":true}
["Event:","Resume review"]
["Date:","2020-02-03"]
["Attendance:",6]
[]
["First Name","Last Name","Year","PSU ID (ex. abc1234)"]
["Jaredf","Asprer","Fr","jza5506"]
["Ilsa","Smith","Jr","ivs5154"]
["Julia","Trigg","Jr","jxt5423"]
["Aidan","Lake","Jr","arl5600"]
["Akash","Patel","Jr","axp428"]
{"$rows_left_out":2}
{"sheet":"Event34","index":6,"n_rows":18,"n_cols":4,"rows_kept":18,"hidden":true}
["Event:","Game Night"]
["Date:","2019-12-10"]
["Attendance:",11]
[]
["First Name","Last Name","Year","PSU ID (ex. abc1234)"]
["Nicolette","Nybro","Jr","nan5101"]
["Julia","Trigg","Jr","jxt5423"]
["Molly","Groarke","Jr","mag6298"]
["Ilsa","Smith","Jr","ivs5154"]
["Marceli","Pawlikowski","Jr","mzp5569"]
{"$rows_left_out":9}
{"sheet":"Event33","index":7,"n_rows":15,"n_cols":4,"rows_kept":15,"hidden":true}
["Event:","Lunch With Leaders #1"]
["Date:","2019-12-06"]
["Attendance:",9]
[]
["First Name","Last Name","Year","PSU ID (ex. abc1234)"]
["Nicolette","Nybro","Jr","nan5101"]
["Vince","Birch","So","vpb5085"]
["Avery","Ryan","Jr","aer5483"]
["Julia","Trigg","Jr","jxt5423"]
["Kristen","Chomos","Fr","kec5791"]
{"$rows_left_out":6}
{"sheet":"Event32","index":8,"n_rows":33,"n_cols":4,"rows_kept":33,"hidden":true}
["Event:","Excel workshop john miller"]
["Date:","2019-12-09","took place 9/12"]
["Attendance:",28]
[]
["First Name","Last Name","Year","PSU ID (ex. abc1234)"]
["Michael","Secosky","Fr","mvs6517"]
["Mason","Cary","Fr","msc5673"]
["Marceli","Pawlikowski","Jr","mzp5569"]
["Matt","Rauber","Fr","mzr5708"]
["Dustin ","Bauer","Fr","dtb5308"]
{"$rows_left_out":24}
{"sheet":"Event31","index":9,"n_rows":12,"n_cols":4,"rows_kept":12,"hidden":true}
["Event:","Mark Toniatti Evaluating an Offer"]
["Date:","2019-11-04"]
["Attendance:",7]
[]
["First Name","Last Name","Year","PSU ID (ex. abc1234)"]
["Julia","Trigg","Jr","jxt5423"]
["Chaoyi","Zhu","Sr","cxz94"]
["Max","Cohen","Fr","mvc6160"]
["Qiaojuan(Tina)","Tu ","So","qkt5010"]
["Jared","Asprer","Fr","jza550"]
{"$rows_left_out":3}
{"sheet":"Event30","index":10,"n_rows":52,"n_cols":4,"rows_kept":52,"hidden":true}
["Event:","Survey"]
["Date:","2019-11-03"]
["Attendance:",47]
[]
["First Name","Last Name","Year","PSU ID (ex. abc1234)"]
["Daniel","Berlin",null,"dnb5266"]
["Jake","Walinsky",null,"jpw5829"]
["Yixiao","Jiang",null,"yxj38"]
["Matt","Owens",null,"mro5212"]
["Emily","Jackson -erj5094",null,"erj5094"]
{"$rows_left_out":43}
{"sheet":"Event29","index":11,"n_rows":48,"n_cols":4,"rows_kept":48,"hidden":true}
["Event:","Brian Evanko"]
["Date:","2019-10-20"]
["Attendance:",{"$f":"COUNTA(A6:A200)","v":43}]
[]
["First Name","Last Name","Year","PSU ID (ex. abc1234)"]
["Molly","Groarke","Jr","mag6298"]
["Guanzong","Zi","So","gzz5074"]
["Kristin","Sickau","Sr","kxs823"]
["Julia","Trigg","Jr","jxt5423"]
["Qiaojuan","Tu","So","qkt5010"]
{"$rows_left_out":39}
{"sheet":"Event28","index":12,"n_rows":11,"n_cols":4,"rows_kept":11,"hidden":true}
["Event:","Underclassmen Involvment Frisbee Event"]
["Date:","2019-10-04"]
["Attendance:",4]
[]
["First Name","Last Name","Year","PSU ID (ex. abc1234)"]
["Nicolette","Nybro","Jr","nan5101"]
["Vince","Birch","So","vpb5085"]
["Adie","Ramirez","Fr","acr5597"]
["Dustin","Bauer","Fr","dtb5308"]
["David","Turonis","Fr","dft5163"]
{"$rows_left_out":2}
{"sheet":"Event27","index":13,"n_rows":15,"n_cols":4,"rows_kept":15,"hidden":true}
["Event:","Lunch With Leaders #1"]
["Date:","2019-10-11"]
["Attendance:",10]
[]
["First Name","Last Name","Year","PSU ID (ex. abc1234)"]
["Nicolette","Nybro","Jr","nan5101"]
["Vince","Birch","So","vpb5085"]
["Dustin","Bauer","Fr","dtb5308"]
["J.P.","Grattan","Fr","jqg5723"]
["Adie","Ramirez","Fr","acr5597"]
{"$rows_left_out":6}
{"sheet":"Event26","index":14,"n_rows":9,"n_cols":4,"rows_kept":9,"hidden":true}
["Event:","BlueCross BlueShield Info Session"]
["Date:","2019-09-29"]
["Attendance:",4]
[]
["First Name","Last Name","Year","PSU ID (ex. abc1234)"]
["Duong","Nguyen","Sr","dnn5"]
["Sawyer","Parks","So","sjp5946"]
["Kristin","Sickau","Jr","kxs823"]
["Ayo","Ogurnombi","So","aeo5162"]

{"sheet":"Event25","index":15,"n_rows":85,"n_cols":4,"rows_kept":85,"hidden":true}
["Event:","International Student Meeting"]
["Date:","2019-09-30"]
["Attendance:",{"$f":"COUNTA(A6:A999)","v":80}]
[]
["First Name","Last Name","Year","PSU ID (ex. abc1234)"]
["Kim","Mincin","So","kfm5441"]
["Nicholas","Mirandi ","So","nxm5386"]
["J.P.","Grattan","Fr","jqg5723"]
["Jack","Berry","Fr","jnb5602"]
["Adie","Ramirez ","Fr","Acr5597"]
{"$rows_left_out":76}
{"sheet":"Event24","index":16,"n_rows":15,"n_cols":4,"rows_kept":15,"hidden":true}
["Event:","International Student Meeting"]
["Date:","2019-09-30"]
["Attendance:",10]
[]
["First Name","Last Name","Year","PSU ID (ex. abc1234)"]
["Xinchen","Yuan","Jr","xpy5054@psu.edu"]
["Shurui","Xu","So","sxx5076"]
["Zhiyang","Liang","So","zfl5166@psu.edu"]
["Ahmed ","AlJaberi","Fr","ama7410@psu.edu"]
["Haozheng","Chen","Jr","hjc5263@psu.edu"]
{"$rows_left_out":6}
{"sheet":"Event23","index":17,"n_rows":13,"n_cols":4,"rows_kept":13,"hidden":true}
["Event:","Freshman Creamery Meet & Greet"]
["Date:","2019-09-20"]
["Attendance:",8]
[]
["First Name","Last Name","Year","PSU ID (ex. abc1234)"]
["Nicolette","Nybro","Jr","nan5101"]
["Vince","Birch","So","vpb5085"]
["Maria ","Howe","So"]
["Lauren","Spicher","Fr","les5774"]
["Nick ","Sawtelle","Fr","nes721"]
{"$rows_left_out":4}
{"sheet":"Event22","index":18,"n_rows":23,"n_cols":4,"rows_kept":23,"hidden":true}
["Event:","Deloitte Consulting "]
["Date:","2019-09-16"]
["Attendance:",18]
[]
["First Name","Last Name","Year","PSU ID (ex. abc1234)"]
["Brian","Garbacik","So","brg16"]
["Erin","Studdert","Fr","eqs5521"]
["maya","DiGirolamo","So","mvd5783"]
["Justin","Strecker","Sr","jxs6288"]
["Patrick","Voss","So","puv44"]
{"$rows_left_out":14}
{"sheet":"Event21","index":19,"n_rows":13,"n_cols":4,"rows_kept":13,"hidden":true}
["Event:","Independence Blue Cross"]
["Date:","2018-09-16"]
["Attendance:",8]
[]
["First Name","Last Name","Year","PSU ID (ex. abc1234)"]
["Akash","Patel","Jr","axp428"]
["Conor","Wilkinson","Sr","cgw5129"]
["Jacob","Niedermayer","Sr","jtn5161"]
["Geoffrey","Barratt","So","gxb92"]
["Rachel","Sudo","Sr","rbs5427"]
{"$rows_left_out":4}
{"sheet":"Event20","index":20,"n_rows":15,"n_cols":4,"rows_kept":15,"hidden":true}
["Event:","EY"]
["Date:","2019-09-16"]
["Attendance:",10]
[]
["First Name","Last Name","Year","PSU ID (ex. abc1234)"]
["Marceli","Pawlikowski","Jr","mzp5569"]
["Alexa","Tannenbaum","So","aqt5407"]
["Jiaqi","Lai","Sr","jzl38"]
["Michael","Noethiger","Jr","mbn5156"]
["Collin","Cicconi","Sr","cac6338"]
{"$rows_left_out":6}
{"sheet":"Event19","index":21,"n_rows":14,"n_cols":4,"rows_kept":14,"hidden":true}
["Event:","Oliver Wyman Info Session"]
["Date:","2019-09-16"]
["Attendance:",9]
[]
["First Name","Last Name","Year","PSU ID (ex. abc1234)"]
["Allison ","Seibert","Sr","azs6047"]
["May","Feng","Sr","muf72"]
["Atharv","Gupte","Sr","abg5424"]
["Marceli","Pawlikowski","Jr","mzp5569"]
["Avery","Ryan","Jr","aer5483"]
{"$rows_left_out":5}
{"sheet":"Event18","index":22,"n_rows":19,"n_cols":4,"rows_kept":19,"hidden":true}
["Event:","GuardianInfoSession"]
["Date:","2019-09-16"]
["Attendance:",14]
[]
["First Name","Last Name","Year","PSU ID (ex. abc1234)"]
["Noah","Donten","Jr","nmd5348"]
["Solomon","Szeto","So","sms8118"]
["Franklyn","Snyderman","Jr","fts5025"]
["Lauren","Spicher","Fr","les5774"]
["erin","wicker","So","euw60"]
{"$rows_left_out":10}
{"sheet":"Event17","index":23,"n_rows":25,"n_cols":4,"rows_kept":25,"hidden":true}
["Event:","Munich Re Info Session"]
["Date:","2019-09-15"]
["Attendance:",20]
[]
["First Name","Last Name","Year","PSU ID (ex. abc1234)"]
["Nicolette","Nybro","Jr","nan5101"]
["Haozheng","chen","Jr","hjc5263"]
["Brandon","Crawford","Jr","bmc5819"]
["Qin ","Zhang","Sr","qfz5029"]
["Kevin","Suryanto","Jr","kas7146"]
{"$rows_left_out":16}
{"sheet":"Event16","index":24,"n_rows":54,"n_cols":4,"rows_kept":54,"hidden":true}
["Event:","highmark Info session"]
["Date:","2019-09-15"]
["Attendance:",49]
[]
["First Name","Last Name","Year","PSU ID (ex. abc1234)"]
["erin","wicker","So","euw60"]
["Taylor ","Geppert","So","stg5184"]
["Geoffrey","Barratt","So","gxb92"]
["Kimberly","Mincin","So","kfm5441"]
["Andrew","Creager","Sr","azc5570"]
{"$rows_left_out":45}
{"sheet":"Event15","index":25,"n_rows":29,"n_cols":4,"rows_kept":29,"hidden":true}
["Event:","Genworth Info Session"]
["Date:","2018-09-15"]
["Attendance:",22]
[]
["First Name","Last Name","Year","PSU ID (ex. abc1234)"]
["Alexis","Lasko","Sr","all5680"]
["Lauren","Spicher","Fr","les5774"]
["Peter","DeMallie","Jr","prd5123"]
["Greg","Westfall","So","gvw5064"]
["Dehan(Roger)","Li","Jr","dzl5429"]
{"$rows_left_out":20}
{"sheet":"Event14","index":26,"n_rows":36,"n_cols":4,"rows_kept":36,"hidden":true}
["Event:","New York Life "]
["Date:","2019-09-15"]
["Attendance:",29]
[]
["First Name","Last Name","Year","PSU ID (ex. abc1234)"]
["Kevin","Suryanto","Jr","kas7146"]
["Felishia",null,"Jr","ffn5018"]
["Daniel","Berlin","Fr","dnb5266"]
["Zhengyan","Yuan","Sr","zqy5133"]
["Haozheng","Chen","Jr","hjc5263"]
{"$rows_left_out":27}
{"sheet":"Event13","index":27,"n_rows":14,"n_cols":4,"rows_kept":14,"hidden":true}
["Event:","Wakely Consulting"]
["Date:","2019-09-15"]
["Attendance:",9]
[]
["First Name","Last Name","Year","PSU ID (ex. abc1234)"]
["Marceli","Pawlikowski","Jr","mzp5569"]
["Andrew","creager","Sr","azc5570"]
["Kai-Uwe","Konrad","So","kwk5449"]
["Rohan","Bhandarkar","Sr","rpb5416"]
["Jacob","Niedermayer","Sr","jtn5161"]
{"$rows_left_out":5}
{"sheet":"Event12","index":28,"n_rows":53,"n_cols":4,"rows_kept":53,"hidden":true}
["Event:","Prudential Info Session"]
["Date:","2019-09-15"]
["Attendance:",36]
[]
["First Name","Last Name","Year","PSU ID (ex. abc1234)"]
["Marceli","Pawlikowski","Jr","Mzp5569"]
["erin","wicker","So","euw60"]
["Brian","Garbacik","So","brg16"]
["Michael","Noethiger","Jr","Mbn5156"]
["kevin","fraccalvieri","So","kkf5177"]
{"$rows_left_out":44}
{"sheet":"Event11","index":29,"n_rows":41,"n_cols":4,"rows_kept":41,"hidden":true}
["Event:","Prudential Info Session"]
["Date:","2019-09-15"]
["Attendance:",36]
[]
["First Name","Last Name","Year","PSU ID (ex. abc1234)"]
["Vince","Birch","So","vpb5085"]
["Hailey","Johnson","So","hqj5199"]
["Kim","Mincin","So","kfm5441"]
["maya","DiGirolamo","So","mvd5783"]
["kevin","Fraccalvieri","So","kkf5177"]
{"$rows_left_out":32}
{"sheet":"Event10","index":30,"n_rows":16,"n_cols":4,"rows_kept":16,"hidden":true}
["Event:","Event"]
["Date:","2019-09-15"]
["Attendance:",11]
[]
["First Name","Last Name","Year","PSU ID (ex. abc1234)"]
["Aidan","Lake","Jr","arl5600"]
["Michael","Noethiger","Jr","mbn5156"]
["Kimberly","Anderson","Sr","ksa5170"]
["Kevin","Logan","Jr","ktl5134"]
["Akash","Patel","Jr","axp428"]
{"$rows_left_out":7}
{"sheet":"Event9","index":31,"n_rows":26,"n_cols":4,"rows_kept":26,"hidden":true}
["Event:","Guy Carpenter Information Session"]
["Date:","2019-09-15"]
["Attendance:",21]
[]
["First Name","Last Name","Year","PSU ID (ex. abc1234)"]
["Marceli","Pawlikowski","Jr","mzp5569"]
["Zhiyang","Liang","So","zfl5166"]
["`guanzong","`zi","So","gzz5074"]
["John","Miller","Sr","jdm6057"]
["Collin","O'Connell","Jr","cpo5122"]
{"$rows_left_out":17}
{"sheet":"Event8","index":32,"n_rows":24,"n_cols":4,"rows_kept":24,"hidden":true}
["Event:","Lincoln Financial Group"]
["Date:","2019-09-15"]
["Attendance:",19]
[]
["First Name","Last Name","Year","PSU ID (ex. abc1234)"]
["Akash","Patel","Jr","axp428"]
["Jennifer","Davis","Jr","jrd5822"]
["Wilton","Chen","Jr","wkc5083"]
["Greg","Westfall","So","gvw5064"]
["Duong","Nguyen","Sr","dnn5"]
{"$rows_left_out":15}
{"sheet":"Event7","index":33,"n_rows":30,"n_cols":4,"rows_kept":30,"hidden":true}
["Event:","Willis Towers Watson info session"]
["Date:","2019-09-15"]
["Attendance:",25]
[]
["First Name","Last Name","Year","PSU ID (ex. abc1234)"]
["Jiaqi","Lai","Sr","jzl38"]
["Kevin ","Suryanto","Jr","kas7146"]
["Felishia","Felishia","Jr","ffn5018"]
["Alexis","Lasko","Sr","all5680"]
["Justin","Strecker","Sr","jxs6288"]
{"$rows_left_out":21}
{"sheet":"Event6","index":34,"n_rows":5,"n_cols":4,"rows_kept":5,"hidden":true}
["Event:","Event"]
["Date:","2019-09-10"]
["Attendance:",0,null,"mistakenly duplicated"]
[]
["First Name","Last Name","Year","PSU ID (ex. abc1234)"]

{"sheet":"Event5","index":35,"n_rows":34,"n_cols":4,"rows_kept":34,"hidden":true}
["Event:","Event"]
["Date:","2019-09-10"]
["Attendance:",29]
[]
["First Name","Last Name","Year","PSU ID (ex. abc1234)"]
["Aidan","Lake","Jr","arl5600"]
["Jonah","Wyzomirski","So","jrw6009"]
["Cristina","Peloro","So","czp5434"]
["Kara","Gibbon","So","kxg295"]
["Jake","Wagner","So","jfw5541"]
{"$rows_left_out":25}
{"sheet":"Event4","index":36,"n_rows":29,"n_cols":5,"rows_kept":29,"hidden":true}
["Event:","Panel/ResumeReviews2"]
["Date:","2019-09-11"]
["Attendance:",24]
[]
["First Name","Last Name","Year","PSU ID (ex. abc1234)"]
["Zhiyang","Liang","So","zfl5166"]
["Matt","McClintick","So","mjm7869"]
["Derek","Long","Sr","dgl5098"]
["Molly","Groarke","Jr","mag6298"]
["Ilsa","Smith","Jr","ivs5154"]
{"$rows_left_out":20}
{"sheet":"Event3","index":37,"n_rows":24,"n_cols":4,"rows_kept":24,"hidden":true}
["Event:","Erie Insurance Info Session"]
["Date:","2019-09-10"]
["Attendance:",19]
[]
["First Name","Last Name","Year","PSU ID (ex. abc1234)"]
["Sawyer","Parks","So","sjp5946"]
["Daniel","Berlin","Fr","dnb5266"]
["Nathan","Newman","Jr","ngn5017"]
["Jonah","Wyzomirski","So","jrw6009"]
["Kara","Gibbon","So","kxg295"]
{"$rows_left_out":15}
{"sheet":"Event2","index":38,"n_rows":19,"n_cols":4,"rows_kept":19,"hidden":true}
["Event:","ResumeReview/Mock Interview"]
["Date:","2019-09-09"]
["Attendance:",14]
[]
["First Name","Last Name","Year","PSU ID (ex. abc1234)"]
["Kai-Uwe","Konrad","So","kwk5449"]
["Jordan","Reiter","Sr","jar6334"]
["Daniel","Berlin","Fr","dnb5266"]
["Guanzong","Zi","So","gzz5074"]
["Matt","Rauber","Fr","mzr5708"]
{"$rows_left_out":10}
{"sheet":"Event1","index":39,"n_rows":8,"n_cols":4,"rows_kept":8,"hidden":true}
["Event:","Commonwealth Actuarial Student Meeting"]
["Date:","2019-09-04"]
["Attendance:",3]
[]
["First Name","Last Name","Year","PSU ID (ex. abc1234)"]
["Chaoyi","Zhu","Sr","cxz94"]
["Letitia obiero","Obiero","Fr","luo114"]
["Nick","Sawtelle","Fr","nus721"]

{"sheet":"Major Forum Roster","index":40,"n_rows":69,"n_cols":7,"rows_kept":69,"hidden":true}
["8/23/2018 Act. Sci. Major Forum Sign-In"]
[]
["First","Last","PSU ID","Year","Paid Dues?","Phone Number (to be added in GroupMe)"]
{"$rows_empty":65}
[{"$nulls":6},"**Also signed in on other computer, paid dues"]

{"sheet":"Due Raw","index":41,"n_rows":154,"n_cols":3,"rows_kept":154,"hidden":true}
["Last Name","First Name","Paid Dues?"]
["Alladi","Shiva","yes"]
["Allen","Kody","yes"]
["Arena","Alex","yes"]
["Aument","Colby","yes"]
["Barratt","Geoffrey","yes"]
["Baurle","Kurt","yes"]
["Bhandarkar","Rohan","no"]
["Birch","Paul","yes"]
["Bromberg","David","no"]
{"$rows_left_out":145}
{"sheet":"Dues Look-Up table","index":42,"n_rows":4,"n_cols":24,"rows_kept":4,"hidden":true}
[{"$nulls":7},"This is a lookup table to match a user ID to people who have paid dues",{"$nulls":9},"This is a list of people who paid dues and whos id we have but didn't pay dues at an event so they have to be added to the end of this list"]
[{"$nulls":7},"This will need to be updated after each new event (just copy and paste from the home tab"]
[{"$nulls":7},"There are issues if someone has paid dues but has not attended any events"]
[{"$nulls":23},"Michal Roby"]

{"sheet":"Mock Interview Raw Data","index":43,"n_rows":97,"n_cols":5,"rows_kept":97,"hidden":true}
["Name","Email","First","Last","ID"]
["Allen, Kody","KLA5319@psu.edu",{"$f":"RIGHT(A2,LEN(A2)-FIND(\",\",A2)-1)","v":"Kody"},{"$f":"LEFT(A2,FIND(\",\",A2)-1)","v":"Allen"},{"$f":"LEFT(B2,FIND(\"@\",B2)-1)","v":"KLA5319"}]
["Anderson, Kimberly","KSA5170@psu.edu","Kimberly","Anderson","KSA5170"]
["Arena, Alexander","AFA5399@psu.edu","Alexander","Arena","AFA5399"]
["Azhar, Ahmad Mohd","AQM6158@psu.edu","Ahmad Mohd","Azhar","AQM6158"]
["Beard, Mallory","MMB6124@psu.edu","Mallory","Beard","MMB6124"]
["California, Margot","MAC6866@psu.edu","Margot","California","MAC6866"]
["Carp, Alexis","AMC7067@psu.edu","Alexis","Carp","AMC7067"]
["Chen, Shumin","QUC54@psu.edu","Shumin","Chen","QUC54"]
["Chen, Ying","YMC5189@psu.edu","Ying","Chen","YMC5189"]
{"$rows_left_out":87}