{"text_format":"1","workbook":"xlsx","n_sheets":34,"sheets":["Student Page","Home","Instructions","Dues","Interview","Event25","Event24","Event23","Event22","Event21","Event20","Event19","Event18","Event17","Event16","Event15","Event14","Event13","Event12","Event11","Event10","Event9","Event8","Event7","Event6","Event5","Event4","Event3","Event2","Event1","Major Forum Roster","Due Raw","Dues Look-Up table","Mock Interview Raw Data"],"not_rendered":{"charts":0,"images":0,"macros":1,"external_links":0,"defined_names":5,"comments":0,"pivot_tables":0},"unopened":[],"bounds":{"document_bytes":16777216,"sheet_cells":100000,"rows_first":2000,"rows_last":500,"rows_between":2000,"halvings":0,"cell_chars":16384,"cell_head_chars":4096},"cells_cut":0,"cells_raw":0,"read":"whole","date_system":"1900"}

{"sheet":"Student Page","index":0,"n_rows":7,"n_cols":2,"rows_kept":7,"cut":false,"hidden":false,"merged":[[1,0,1,2],[2,1,2,2],[3,1,3,2],[0,1,0,2],[7,1,7,2],[6,1,6,2],[4,1,4,2],[5,1,5,2]]}
["Points as of: ",{"$f":"Home!C1","v":"2018-09-21"}]
["Enter your ID (ex. abc1234) to check your points"]
["ID","pvb5171"]
["Points",{"$f":"VLOOKUP(B3, Home!$D:$E, 2, FALSE)","v":7}]
["Dues",{"$f":"VLOOKUP(B3, Home!D:F, 3, FALSE)","v":"Yes"}]
["Mock Interview",{"$f":"VLOOKUP(B3, Home!D:G, 4, FALSE)","v":"N/A"}]
["Next Steps",{"$f":"IF(OR(MONTH(B1)=8, AND(MONTH(B1)=9, DAY(B1)<=17)),\nIF(AND(B4>=2, B5<>\"No\", B6<>\"No\"), Instructions!A11, IF(B4<2, Instructions!A6, \"\") & IF(B5=\"No\", Instructions!B6, \"\") & IF(B6=\"No\", Instructions!C6, \"\") & Instructions!D6),\nIF(OR(B4<2, B5=\"No\", B6=\"No\"), IF(B4<2, Instructions!A7, \"\") & IF(B5=\"No\", Instructions!B7, \"\") & IF(B6=\"No\", Instructions!C7, \"\") & Instructions!D7,\nIF(B4<5, Instructions!A8 & Instructions!D8, IF(B4<10, Instructions!A9 & Instructions!D9, IF(B4<15, Instructions!A10 & Instructions!D10, Instructions!A11)))))","v":"Reach 10 points, allowing you to receive special recognition in resume book beginning spring 2019"}]

{"sheet":"Home","index":1,"n_rows":266,"n_cols":7,"rows_kept":266,"cut":false,"hidden":true,"merged":[]}
["Points Updated as of: ",null,"2018-09-21"]
["Number of events:",null,25]
["Total Members:",null,{"$f":"COUNTA(D8:D1000)","v":259}]
[]
[]
[]
["First","Last","Year","ID","Total","Dues","Mock Interview"]
["Brent","Nachison","Jr","bjn5158",{"$f":"COUNTIF(Event1!$D:$D, D8) + COUNTIF(Event2!$D:$D, D8) + COUNTIF(Event3!$D:$D, D8) + COUNTIF(Event4!$D:$D, D8) + COUNTIF(Event5!$D:$D, D8) + COUNTIF(Event6!$D:$D, D8) + COUNTIF(Event7!$D:$D, D8) + COUNTIF(Event8!$D:$D, D8) + COUNTIF(Event9!$D:$D, D8) + COUNTIF(Event10!$D:$D, D8) + COUNTIF(Event11!$D:$D, D8) + COUNTIF(Event12!$D:$D, D8) + COUNTIF(Event13!$D:$D, D8) + COUNTIF(Event14!$D:$D, D8) + COUNTIF(Event15!$D:$D, D8) + COUNTIF(Event16!$D:$D, D8) + COUNTIF(Event17!$D:$D, D8) + COUNTIF(Event18!$D:$D, D8) + COUNTIF(Event19!$D:$D, D8) + COUNTIF(Event20!$D:$D, D8) + COUNTIF(Event21!$D:$D, D8) + COUNTIF(Event22!$D:$D, D8) + COUNTIF(Event23!$D:$D, D8) + COUNTIF(Event24!$D:$D, D8) + COUNTIF(Event25!$D:$D, D8) + 0","v":16},{"$f":"IF(D8=\"\", \"\", IF(IFERROR(VLOOKUP(D8, Dues!D:D, 1, FALSE), \"\")=\"\", \"No\", \"Yes\"))","v":"Yes"},{"$f":"IF(D8=\"\", \"\", IF(IFERROR(VLOOKUP(D8, Interview!D:D, 1, FALSE), \"\")<>\"\", \"Yes\", IF(OR(C8=\"Fr\", C8=\"So\", AND(C8=\"Sr\", TODAY()<43646)), \"N/A\", \"No\")))","v":"Yes"}]
["Chaoyi","Zhu","Jr","cxz94",{"$f":"COUNTIF(Event1!$D:$D, D9) + COUNTIF(Event2!$D:$D, D9) + COUNTIF(Event3!$D:$D, D9) + COUNTIF(Event4!$D:$D, D9) + COUNTIF(Event5!$D:$D, D9) + COUNTIF(Event6!$D:$D, D9) + COUNTIF(Event7!$D:$D, D9) + COUNTIF(Event8!$D:$D, D9) + COUNTIF(Event9!$D:$D, D9) + COUNTIF(Event10!$D:$D, D9) + COUNTIF(Event11!$D:$D, D9) + COUNTIF(Event12!$D:$D, D9) + COUNTIF(Event13!$D:$D, D9) + COUNTIF(Event14!$D:$D, D9) + COUNTIF(Event15!$D:$D, D9) + COUNTIF(Event16!$D:$D, D9) + COUNTIF(Event17!$D:$D, D9) + COUNTIF(Event18!$D:$D, D9) + COUNTIF(Event19!$D:$D, D9) + COUNTIF(Event20!$D:$D, D9) + COUNTIF(Event21!$D:$D, D9) + COUNTIF(Event22!$D:$D, D9) + COUNTIF(Event23!$D:$D, D9) + COUNTIF(Event24!$D:$D, D9) + COUNTIF(Event25!$D:$D, D9) + 0","v":15},{"$f":"IF(D9=\"\", \"\", IF(IFERROR(VLOOKUP(D9, Dues!D:D, 1, FALSE), \"\")=\"\", \"No\", \"Yes\"))","v":"Yes"},{"$f":"IF(D9=\"\", \"\", IF(IFERROR(VLOOKUP(D9, Interview!D:D, 1, FALSE), \"\")<>\"\", \"Yes\", IF(OR(C9=\"Fr\", C9=\"So\", AND(C9=\"Sr\", TODAY()<43646)), \"N/A\", \"No\")))","v":"No"}]
["Beckett","Cromer","Sr","bdc5221",{"$f":"COUNTIF(Event1!$D:$D, D10) + COUNTIF(Event2!$D:$D, D10) + COUNTIF(Event3!$D:$D, D10) + COUNTIF(Event4!$D:$D, D10) + COUNTIF(Event5!$D:$D, D10) + COUNTIF(Event6!$D:$D, D10) + COUNTIF(Event7!$D:$D, D10) + COUNTIF(Event8!$D:$D, D10) + COUNTIF(Event9!$D:$D, D10) + COUNTIF(Event10!$D:$D, D10) + COUNTIF(Event11!$D:$D, D10) + COUNTIF(Event12!$D:$D, D10) + COUNTIF(Event13!$D:$D, D10) + COUNTIF(Event14!$D:$D, D10) + COUNTIF(Event15!$D:$D, D10) + COUNTIF(Event16!$D:$D, D10) + COUNTIF(Event17!$D:$D, D10) + COUNTIF(Event18!$D:$D, D10) + COUNTIF(Event19!$D:$D, D10) + COUNTIF(Event20!$D:$D, D10) + COUNTIF(Event21!$D:$D, D10) + COUNTIF(Event22!$D:$D, D10) + COUNTIF(Event23!$D:$D, D10) + COUNTIF(Event24!$D:$D, D10) + COUNTIF(Event25!$D:$D, D10) + 0","v":14},{"$f":"IF(D10=\"\", \"\", IF(IFERROR(VLOOKUP(D10, Dues!D:D, 1, FALSE), \"\")=\"\", \"No\", \"Yes\"))","v":"Yes"},{"$f":"IF(D10=\"\", \"\", IF(IFERROR(VLOOKUP(D10, Interview!D:D, 1, FALSE), \"\")<>\"\", \"Yes\", IF(OR(C10=\"Fr\", C10=\"So\", AND(C10=\"Sr\", TODAY()<43646)), \"N/A\", \"No\")))","v":"N/A"}]
["Taras","Guanowsky","Jr","txg206",{"$f":"COUNTIF(Event1!$D:$D, D11) + COUNTIF(Event2!$D:$D, D11) + COUNTIF(Event3!$D:$D, D11) + COUNTIF(Event4!$D:$D, D11) + COUNTIF(Event5!$D:$D, D11) + COUNTIF(Event6!$D:$D, D11) + COUNTIF(Event7!$D:$D, D11) + COUNTIF(Event8!$D:$D, D11) + COUNTIF(Event9!$D:$D, D11) + COUNTIF(Event10!$D:$D, D11) + COUNTIF(Event11!$D:$D, D11) + COUNTIF(Event12!$D:$D, D11) + COUNTIF(Event13!$D:$D, D11) + COUNTIF(Event14!$D:$D, D11) + COUNTIF(Event15!$D:$D, D11) + COUNTIF(Event16!$D:$D, D11) + COUNTIF(Event17!$D:$D, D11) + COUNTIF(Event18!$D:$D, D11) + COUNTIF(Event19!$D:$D, D11) + COUNTIF(Event20!$D:$D, D11) + COUNTIF(Event21!$D:$D, D11) + COUNTIF(Event22!$D:$D, D11) + COUNTIF(Event23!$D:$D, D11) + COUNTIF(Event24!$D:$D, D11) + COUNTIF(Event25!$D:$D, D11) + 0","v":14},{"$f":"IF(D11=\"\", \"\", IF(IFERROR(VLOOKUP(D11, Dues!D:D, 1, FALSE), \"\")=\"\", \"No\", \"Yes\"))","v":"Yes"},{"$f":"IF(D11=\"\", \"\", IF(IFERROR(VLOOKUP(D11, Interview!D:D, 1, FALSE), \"\")<>\"\", \"Yes\", IF(OR(C11=\"Fr\", C11=\"So\", AND(C11=\"Sr\", TODAY()<43646)), \"N/A\", \"No\")))","v":"Yes"}]
["Jacob","Niedermayer","Jr","jtn5161",{"$f":"COUNTIF(Event1!$D:$D, D12) + COUNTIF(Event2!$D:$D, D12) + COUNTIF(Event3!$D:$D, D12) + COUNTIF(Event4!$D:$D, D12) + COUNTIF(Event5!$D:$D, D12) + COUNTIF(Event6!$D:$D, D12) + COUNTIF(Event7!$D:$D, D12) + COUNTIF(Event8!$D:$D, D12) + COUNTIF(Event9!$D:$D, D12) + COUNTIF(Event10!$D:$D, D12) + COUNTIF(Event11!$D:$D, D12) + COUNTIF(Event12!$D:$D, D12) + COUNTIF(Event13!$D:$D, D12) + COUNTIF(Event14!$D:$D, D12) + COUNTIF(Event15!$D:$D, D12) + COUNTIF(Event16!$D:$D, D12) + COUNTIF(Event17!$D:$D, D12) + COUNTIF(Event18!$D:$D, D12) + COUNTIF(Event19!$D:$D, D12) + COUNTIF(Event20!$D:$D, D12) + COUNTIF(Event21!$D:$D, D12) + COUNTIF(Event22!$D:$D, D12) + COUNTIF(Event23!$D:$D, D12) + COUNTIF(Event24!$D:$D, D12) + COUNTIF(Event25!$D:$D, D12) + 0","v":12},{"$f":"IF(D12=\"\", \"\", IF(IFERROR(VLOOKUP(D12, Dues!D:D, 1, FALSE), \"\")=\"\", \"No\", \"Yes\"))","v":"Yes"},{"$f":"IF(D12=\"\", \"\", IF(IFERROR(VLOOKUP(D12, Interview!D:D, 1, FALSE), \"\")<>\"\", \"Yes\", IF(OR(C12=\"Fr\", C12=\"So\", AND(C12=\"Sr\", TODAY()<43646)), \"N/A\", \"No\")))","v":"Yes"}]
["Nicolette","Nybro","So","nan5101",{"$f":"COUNTIF(Event1!$D:$D, D13) + COUNTIF(Event2!$D:$D, D13) + COUNTIF(Event3!$D:$D, D13) + COUNTIF(Event4!$D:$D, D13) + COUNTIF(Event5!$D:$D, D13) + COUNTIF(Event6!$D:$D, D13) + COUNTIF(Event7!$D:$D, D13) + COUNTIF(Event8!$D:$D, D13) + COUNTIF(Event9!$D:$D, D13) + COUNTIF(Event10!$D:$D, D13) + COUNTIF(Event11!$D:$D, D13) + COUNTIF(Event12!$D:$D, D13) + COUNTIF(Event13!$D:$D, D13) + COUNTIF(Event14!$D:$D, D13) + COUNTIF(Event15!$D:$D, D13) + COUNTIF(Event16!$D:$D, D13) + COUNTIF(Event17!$D:$D, D13) + COUNTIF(Event18!$D:$D, D13) + COUNTIF(Event19!$D:$D, D13) + COUNTIF(Event20!$D:$D, D13) + COUNTIF(Event21!$D:$D, D13) + COUNTIF(Event22!$D:$D, D13) + COUNTIF(Event23!$D:$D, D13) + COUNTIF(Event24!$D:$D, D13) + COUNTIF(Event25!$D:$D, D13) + 0","v":12},{"$f":"IF(D13=\"\", \"\", IF(IFERROR(VLOOKUP(D13, Dues!D:D, 1, FALSE), \"\")=\"\", \"No\", \"Yes\"))","v":"Yes"},{"$f":"IF(D13=\"\", \"\", IF(IFERROR(VLOOKUP(D13, Interview!D:D, 1, FALSE), \"\")<>\"\", \"Yes\", IF(OR(C13=\"Fr\", C13=\"So\", AND(C13=\"Sr\", TODAY()<43646)), \"N/A\", \"No\")))","v":"N/A"}]
["Duong","Nguyen","Jr","dnn5",{"$f":"COUNTIF(Event1!$D:$D, D14) + COUNTIF(Event2!$D:$D, D14) + COUNTIF(Event3!$D:$D, D14) + COUNTIF(Event4!$D:$D, D14) + COUNTIF(Event5!$D:$D, D14) + COUNTIF(Event6!$D:$D, D14) + COUNTIF(Event7!$D:$D, D14) + COUNTIF(Event8!$D:$D, D14) + COUNTIF(Event9!$D:$D, D14) + COUNTIF(Event10!$D:$D, D14) + COUNTIF(Event11!$D:$D, D14) + COUNTIF(Event12!$D:$D, D14) + COUNTIF(Event13!$D:$D, D14) + COUNTIF(Event14!$D:$D, D14) + COUNTIF(Event15!$D:$D, D14) + COUNTIF(Event16!$D:$D, D14) + COUNTIF(Event17!$D:$D, D14) + COUNTIF(Event18!$D:$D, D14) + COUNTIF(Event19!$D:$D, D14) + COUNTIF(Event20!$D:$D, D14) + COUNTIF(Event21!$D:$D, D14) + COUNTIF(Event22!$D:$D, D14) + COUNTIF(Event23!$D:$D, D14) + COUNTIF(Event24!$D:$D, D14) + COUNTIF(Event25!$D:$D, D14) + 0","v":12},{"$f":"IF(D14=\"\", \"\", IF(IFERROR(VLOOKUP(D14, Dues!D:D, 1, FALSE), \"\")=\"\", \"No\", \"Yes\"))","v":"Yes"},{"$f":"IF(D14=\"\", \"\", IF(IFERROR(VLOOKUP(D14, Interview!D:D, 1, FALSE), \"\")<>\"\", \"Yes\", IF(OR(C14=\"Fr\", C14=\"So\", AND(C14=\"Sr\", TODAY()<43646)), \"N/A\", \"No\")))","v":"Yes"}]
["Joseph","Sukunda","Sr","jhs5325",{"$f":"COUNTIF(Event1!$D:$D, D15) + COUNTIF(Event2!$D:$D, D15) + COUNTIF(Event3!$D:$D, D15) + COUNTIF(Event4!$D:$D, D15) + COUNTIF(Event5!$D:$D, D15) + COUNTIF(Event6!$D:$D, D15) + COUNTIF(Event7!$D:$D, D15) + COUNTIF(Event8!$D:$D, D15) + COUNTIF(Event9!$D:$D, D15) + COUNTIF(Event10!$D:$D, D15) + COUNTIF(Event11!$D:$D, D15) + COUNTIF(Event12!$D:$D, D15) + COUNTIF(Event13!$D:$D, D15) + COUNTIF(Event14!$D:$D, D15) + COUNTIF(Event15!$D:$D, D15) + COUNTIF(Event16!$D:$D, D15) + COUNTIF(Event17!$D:$D, D15) + COUNTIF(Event18!$D:$D, D15) + COUNTIF(Event19!$D:$D, D15) + COUNTIF(Event20!$D:$D, D15) + COUNTIF(Event21!$D:$D, D15) + COUNTIF(Event22!$D:$D, D15) + COUNTIF(Event23!$D:$D, D15) + COUNTIF(Event24!$D:$D, D15) + COUNTIF(Event25!$D:$D, D15) + 0","v":11},{"$f":"IF(D15=\"\", \"\", IF(IFERROR(VLOOKUP(D15, Dues!D:D, 1, FALSE), \"\")=\"\", \"No\", \"Yes\"))","v":"No"},{"$f":"IF(D15=\"\", \"\", IF(IFERROR(VLOOKUP(D15, Interview!D:D, 1, FALSE), \"\")<>\"\", \"Yes\", IF(OR(C15=\"Fr\", C15=\"So\", AND(C15=\"Sr\", TODAY()<43646)), \"N/A\", \"No\")))","v":"N/A"}]
["Judy","Kahn","Jr","jbk5410",{"$f":"COUNTIF(Event1!$D:$D, D16) + COUNTIF(Event2!$D:$D, D16) + COUNTIF(Event3!$D:$D, D16) + COUNTIF(Event4!$D:$D, D16) + COUNTIF(Event5!$D:$D, D16) + COUNTIF(Event6!$D:$D, D16) + COUNTIF(Event7!$D:$D, D16) + COUNTIF(Event8!$D:$D, D16) + COUNTIF(Event9!$D:$D, D16) + COUNTIF(Event10!$D:$D, D16) + COUNTIF(Event11!$D:$D, D16) + COUNTIF(Event12!$D:$D, D16) + COUNTIF(Event13!$D:$D, D16) + COUNTIF(Event14!$D:$D, D16) + COUNTIF(Event15!$D:$D, D16) + COUNTIF(Event16!$D:$D, D16) + COUNTIF(Event17!$D:$D, D16) + COUNTIF(Event18!$D:$D, D16) + COUNTIF(Event19!$D:$D, D16) + COUNTIF(Event20!$D:$D, D16) + COUNTIF(Event21!$D:$D, D16) + COUNTIF(Event22!$D:$D, D16) + COUNTIF(Event23!$D:$D, D16) + COUNTIF(Event24!$D:$D, D16) + COUNTIF(Event25!$D:$D, D16) + 0","v":11},{"$f":"IF(D16=\"\", \"\", IF(IFERROR(VLOOKUP(D16, Dues!D:D, 1, FALSE), \"\")=\"\", \"No\", \"Yes\"))","v":"Yes"},{"$f":"IF(D16=\"\", \"\", IF(IFERROR(VLOOKUP(D16, Interview!D:D, 1, FALSE), \"\")<>\"\", \"Yes\", IF(OR(C16=\"Fr\", C16=\"So\", AND(C16=\"Sr\", TODAY()<43646)), \"N/A\", \"No\")))","v":"Yes"}]
["tingting","wu","Sr","tbw5119",{"$f":"COUNTIF(Event1!$D:$D, D17) + COUNTIF(Event2!$D:$D, D17) + COUNTIF(Event3!$D:$D, D17) + COUNTIF(Event4!$D:$D, D17) + COUNTIF(Event5!$D:$D, D17) + COUNTIF(Event6!$D:$D, D17) + COUNTIF(Event7!$D:$D, D17) + COUNTIF(Event8!$D:$D, D17) + COUNTIF(Event9!$D:$D, D17) + COUNTIF(Event10!$D:$D, D17) + COUNTIF(Event11!$D:$D, D17) + COUNTIF(Event12!$D:$D, D17) + COUNTIF(Event13!$D:$D, D17) + COUNTIF(Event14!$D:$D, D17) + COUNTIF(Event15!$D:$D, D17) + COUNTIF(Event16!$D:$D, D17) + COUNTIF(Event17!$D:$D, D17) + COUNTIF(Event18!$D:$D, D17) + COUNTIF(Event19!$D:$D, D17) + COUNTIF(Event20!$D:$D, D17) + COUNTIF(Event21!$D:$D, D17) + COUNTIF(Event22!$D:$D, D17) + COUNTIF(Event23!$D:$D, D17) + COUNTIF(Event24!$D:$D, D17) + COUNTIF(Event25!$D:$D, D17) + 0","v":11},{"$f":"IF(D17=\"\", \"\", IF(IFERROR(VLOOKUP(D17, Dues!D:D, 1, FALSE), \"\")=\"\", \"No\", \"Yes\"))","v":"Yes"},{"$f":"IF(D17=\"\", \"\", IF(IFERROR(VLOOKUP(D17, Interview!D:D, 1, FALSE), \"\")<>\"\", \"Yes\", IF(OR(C17=\"Fr\", C17=\"So\", AND(C17=\"Sr\", TODAY()<43646)), \"N/A\", \"No\")))","v":"N/A"}]
["Matt","Pidgeon","So","mpp5454",{"$f":"COUNTIF(Event1!$D:$D, D18) + COUNTIF(Event2!$D:$D, D18) + COUNTIF(Event3!$D:$D, D18) + COUNTIF(Event4!$D:$D, D18) + COUNTIF(Event5!$D:$D, D18) + COUNTIF(Event6!$D:$D, D18) + COUNTIF(Event7!$D:$D, D18) + COUNTIF(Event8!$D:$D, D18) + COUNTIF(Event9!$D:$D, D18) + COUNTIF(Event10!$D:$D, D18) + COUNTIF(Event11!$D:$D, D18) + COUNTIF(Event12!$D:$D, D18) + COUNTIF(Event13!$D:$D, D18) + COUNTIF(Event14!$D:$D, D18) + COUNTIF(Event15!$D:$D, D18) + COUNTIF(Event16!$D:$D, D18) + COUNTIF(Event17!$D:$D, D18) + COUNTIF(Event18!$D:$D, D18) + COUNTIF(Event19!$D:$D, D18) + COUNTIF(Event20!$D:$D, D18) + COUNTIF(Event21!$D:$D, D18) + COUNTIF(Event22!$D:$D, D18) + COUNTIF(Event23!$D:$D, D18) + COUNTIF(Event24!$D:$D, D18) + COUNTIF(Event25!$D:$D, D18) + 0","v":10},{"$f":"IF(D18=\"\", \"\", IF(IFERROR(VLOOKUP(D18, Dues!D:D, 1, FALSE), \"\")=\"\", \"No\", \"Yes\"))","v":"Yes"},{"$f":"IF(D18=\"\", \"\", IF(IFERROR(VLOOKUP(D18, Interview!D:D, 1, FALSE), \"\")<>\"\", \"Yes\", IF(OR(C18=\"Fr\", C18=\"So\", AND(C18=\"Sr\", TODAY()<43646)), \"N/A\", \"No\")))","v":"Yes"}]
["Julia","Trigg","So","jxt5423",{"$f":"COUNTIF(Event1!$D:$D, D19) + COUNTIF(Event2!$D:$D, D19) + COUNTIF(Event3!$D:$D, D19) + COUNTIF(Event4!$D:$D, D19) + COUNTIF(Event5!$D:$D, D19) + COUNTIF(Event6!$D:$D, D19) + COUNTIF(Event7!$D:$D, D19) + COUNTIF(Event8!$D:$D, D19) + COUNTIF(Event9!$D:$D, D19) + COUNTIF(Event10!$D:$D, D19) + COUNTIF(Event11!$D:$D, D19) + COUNTIF(Event12!$D:$D, D19) + COUNTIF(Event13!$D:$D, D19) + COUNTIF(Event14!$D:$D, D19) + COUNTIF(Event15!$D:$D, D19) + COUNTIF(Event16!$D:$D, D19) + COUNTIF(Event17!$D:$D, D19) + COUNTIF(Event18!$D:$D, D19) + COUNTIF(Event19!$D:$D, D19) + COUNTIF(Event20!$D:$D, D19) + COUNTIF(Event21!$D:$D, D19) + COUNTIF(Event22!$D:$D, D19) + COUNTIF(Event23!$D:$D, D19) + COUNTIF(Event24!$D:$D, D19) + COUNTIF(Event25!$D:$D, D19) + 0","v":9},{"$f":"IF(D19=\"\", \"\", IF(IFERROR(VLOOKUP(D19, Dues!D:D, 1, FALSE), \"\")=\"\", \"No\", \"Yes\"))","v":"Yes"},{"$f":"IF(D19=\"\", \"\", IF(IFERROR(VLOOKUP(D19, Interview!D:D, 1, FALSE), \"\")<>\"\", \"Yes\", IF(OR(C19=\"Fr\", C19=\"So\", AND(C19=\"Sr\", TODAY()<43646)), \"N/A\", \"No\")))","v":"Yes"}]
["Dante","Marcucci","Fr","uum99",{"$f":"COUNTIF(Event1!$D:$D, D20) + COUNTIF(Event2!$D:$D, D20) + COUNTIF(Event3!$D:$D, D20) + COUNTIF(Event4!$D:$D, D20) + COUNTIF(Event5!$D:$D, D20) + COUNTIF(Event6!$D:$D, D20) + COUNTIF(Event7!$D:$D, D20) + COUNTIF(Event8!$D:$D, D20) + COUNTIF(Event9!$D:$D, D20) + COUNTIF(Event10!$D:$D, D20) + COUNTIF(Event11!$D:$D, D20) + COUNTIF(Event12!$D:$D, D20) + COUNTIF(Event13!$D:$D, D20) + COUNTIF(Event14!$D:$D, D20) + COUNTIF(Event15!$D:$D, D20) + COUNTIF(Event16!$D:$D, D20) + COUNTIF(Event17!$D:$D, D20) + COUNTIF(Event18!$D:$D, D20) + COUNTIF(Event19!$D:$D, D20) + COUNTIF(Event20!$D:$D, D20) + COUNTIF(Event21!$D:$D, D20) + COUNTIF(Event22!$D:$D, D20) + COUNTIF(Event23!$D:$D, D20) + COUNTIF(Event24!$D:$D, D20) + COUNTIF(Event25!$D:$D, D20) + 0","v":9},{"$f":"IF(D20=\"\", \"\", IF(IFERROR(VLOOKUP(D20, Dues!D:D, 1, FALSE), \"\")=\"\", \"No\", \"Yes\"))","v":"Yes"},{"$f":"IF(D20=\"\", \"\", IF(IFERROR(VLOOKUP(D20, Interview!D:D, 1, FALSE), \"\")<>\"\", \"Yes\", IF(OR(C20=\"Fr\", C20=\"So\", AND(C20=\"Sr\", TODAY()<43646)), \"N/A\", \"No\")))","v":"Yes"}]
["Shiva","Alladi","Sr","ssa5254",{"$f":"COUNTIF(Event1!$D:$D, D21) + COUNTIF(Event2!$D:$D, D21) + COUNTIF(Event3!$D:$D, D21) + COUNTIF(Event4!$D:$D, D21) + COUNTIF(Event5!$D:$D, D21) + COUNTIF(Event6!$D:$D, D21) + COUNTIF(Event7!$D:$D, D21) + COUNTIF(Event8!$D:$D, D21) + COUNTIF(Event9!$D:$D, D21) + COUNTIF(Event10!$D:$D, D21) + COUNTIF(Event11!$D:$D, D21) + COUNTIF(Event12!$D:$D, D21) + COUNTIF(Event13!$D:$D, D21) + COUNTIF(Event14!$D:$D, D21) + COUNTIF(Event15!$D:$D, D21) + COUNTIF(Event16!$D:$D, D21) + COUNTIF(Event17!$D:$D, D21) + COUNTIF(Event18!$D:$D, D21) + COUNTIF(Event19!$D:$D, D21) + COUNTIF(Event20!$D:$D, D21) + COUNTIF(Event21!$D:$D, D21) + COUNTIF(Event22!$D:$D, D21) + COUNTIF(Event23!$D:$D, D21) + COUNTIF(Event24!$D:$D, D21) + COUNTIF(Event25!$D:$D, D21) + 0","v":9},{"$f":"IF(D21=\"\", \"\", IF(IFERROR(VLOOKUP(D21, Dues!D:D, 1, FALSE), \"\")=\"\", \"No\", \"Yes\"))","v":"Yes"},{"$f":"IF(D21=\"\", \"\", IF(IFERROR(VLOOKUP(D21, Interview!D:D, 1, FALSE), \"\")<>\"\", \"Yes\", IF(OR(C21=\"Fr\", C21=\"So\", AND(C21=\"Sr\", TODAY()<43646)), \"N/A\", \"No\")))","v":"N/A"}]
["Shannon","Cikowski","Jr","spc5519",{"$f":"COUNTIF(Event1!$D:$D, D22) + COUNTIF(Event2!$D:$D, D22) + COUNTIF(Event3!$D:$D, D22) + COUNTIF(Event4!$D:$D, D22) + COUNTIF(Event5!$D:$D, D22) + COUNTIF(Event6!$D:$D, D22) + COUNTIF(Event7!$D:$D, D22) + COUNTIF(Event8!$D:$D, D22) + COUNTIF(Event9!$D:$D, D22) + COUNTIF(Event10!$D:$D, D22) + COUNTIF(Event11!$D:$D, D22) + COUNTIF(Event12!$D:$D, D22) + COUNTIF(Event13!$D:$D, D22) + COUNTIF(Event14!$D:$D, D22) + COUNTIF(Event15!$D:$D, D22) + COUNTIF(Event16!$D:$D, D22) + COUNTIF(Event17!$D:$D, D22) + COUNTIF(Event18!$D:$D, D22) + COUNTIF(Event19!$D:$D, D22) + COUNTIF(Event20!$D:$D, D22) + COUNTIF(Event21!$D:$D, D22) + COUNTIF(Event22!$D:$D, D22) + COUNTIF(Event23!$D:$D, D22) + COUNTIF(Event24!$D:$D, D22) + COUNTIF(Event25!$D:$D, D22) + 0","v":9},{"$f":"IF(D22=\"\", \"\", IF(IFERROR(VLOOKUP(D22, Dues!D:D, 1, FALSE), \"\")=\"\", \"No\", \"Yes\"))","v":"Yes"},{"$f":"IF(D22=\"\", \"\", IF(IFERROR(VLOOKUP(D22, Interview!D:D, 1, FALSE), \"\")<>\"\", \"Yes\", IF(OR(C22=\"Fr\", C22=\"So\", AND(C22=\"Sr\", TODAY()<43646)), \"N/A\", \"No\")))","v":"Yes"}]
["Jiaqi","Lai","Jr","jzl38",{"$f":"COUNTIF(Event1!$D:$D, D23) + COUNTIF(Event2!$D:$D, D23) + COUNTIF(Event3!$D:$D, D23) + COUNTIF(Event4!$D:$D, D23) + COUNTIF(Event5!$D:$D, D23) + COUNTIF(Event6!$D:$D, D23) + COUNTIF(Event7!$D:$D, D23) + COUNTIF(Event8!$D:$D, D23) + COUNTIF(Event9!$D:$D, D23) + COUNTIF(Event10!$D:$D, D23) + COUNTIF(Event11!$D:$D, D23) + COUNTIF(Event12!$D:$D, D23) + COUNTIF(Event13!$D:$D, D23) + COUNTIF(Event14!$D:$D, D23) + COUNTIF(Event15!$D:$D, D23) + COUNTIF(Event16!$D:$D, D23) + COUNTIF(Event17!$D:$D, D23) + COUNTIF(Event18!$D:$D, D23) + COUNTIF(Event19!$D:$D, D23) + COUNTIF(Event20!$D:$D, D23) + COUNTIF(Event21!$D:$D, D23) + COUNTIF(Event22!$D:$D, D23) + COUNTIF(Event23!$D:$D, D23) + COUNTIF(Event24!$D:$D, D23) + COUNTIF(Event25!$D:$D, D23) + 0","v":8},{"$f":"IF(D23=\"\", \"\", IF(IFERROR(VLOOKUP(D23, Dues!D:D, 1, FALSE), \"\")=\"\", \"No\", \"Yes\"))","v":"Yes"},{"$f":"IF(D23=\"\", \"\", IF(IFERROR(VLOOKUP(D23, Interview!D:D, 1, FALSE), \"\")<>\"\", \"Yes\", IF(OR(C23=\"Fr\", C23=\"So\", AND(C23=\"Sr\", TODAY()<43646)), \"N/A\", \"No\")))","v":"Yes"}]
["May","Feng","Jr","muf72",{"$f":"COUNTIF(Event1!$D:$D, D24) + COUNTIF(Event2!$D:$D, D24) + COUNTIF(Event3!$D:$D, D24) + COUNTIF(Event4!$D:$D, D24) + COUNTIF(Event5!$D:$D, D24) + COUNTIF(Event6!$D:$D, D24) + COUNTIF(Event7!$D:$D, D24) + COUNTIF(Event8!$D:$D, D24) + COUNTIF(Event9!$D:$D, D24) + COUNTIF(Event10!$D:$D, D24) + COUNTIF(Event11!$D:$D, D24) + COUNTIF(Event12!$D:$D, D24) + COUNTIF(Event13!$D:$D, D24) + COUNTIF(Event14!$D:$D, D24) + COUNTIF(Event15!$D:$D, D24) + COUNTIF(Event16!$D:$D, D24) + COUNTIF(Event17!$D:$D, D24) + COUNTIF(Event18!$D:$D, D24) + COUNTIF(Event19!$D:$D, D24) + COUNTIF(Event20!$D:$D, D24) + COUNTIF(Event21!$D:$D, D24) + COUNTIF(Event22!$D:$D, D24) + COUNTIF(Event23!$D:$D, D24) + COUNTIF(Event24!$D:$D, D24) + COUNTIF(Event25!$D:$D, D24) + 0","v":8},{"$f":"IF(D24=\"\", \"\", IF(IFERROR(VLOOKUP(D24, Dues!D:D, 1, FALSE), \"\")=\"\", \"No\", \"Yes\"))","v":"No"},{"$f":"IF(D24=\"\", \"\", IF(IFERROR(VLOOKUP(D24, Interview!D:D, 1, FALSE), \"\")<>\"\", \"Yes\", IF(OR(C24=\"Fr\", C24=\"So\", AND(C24=\"Sr\", TODAY()<43646)), \"N/A\", \"No\")))","v":"Yes"}]
["Yixiao","Jiang","Jr","yxj38",{"$f":"COUNTIF(Event1!$D:$D, D25) + COUNTIF(Event2!$D:$D, D25) + COUNTIF(Event3!$D:$D, D25) + COUNTIF(Event4!$D:$D, D25) + COUNTIF(Event5!$D:$D, D25) + COUNTIF(Event6!$D:$D, D25) + COUNTIF(Event7!$D:$D, D25) + COUNTIF(Event8!$D:$D, D25) + COUNTIF(Event9!$D:$D, D25) + COUNTIF(Event10!$D:$D, D25) + COUNTIF(Event11!$D:$D, D25) + COUNTIF(Event12!$D:$D, D25) + COUNTIF(Event13!$D:$D, D25) + COUNTIF(Event14!$D:$D, D25) + COUNTIF(Event15!$D:$D, D25) + COUNTIF(Event16!$D:$D, D25) + COUNTIF(Event17!$D:$D, D25) + COUNTIF(Event18!$D:$D, D25) + COUNTIF(Event19!$D:$D, D25) + COUNTIF(Event20!$D:$D, D25) + COUNTIF(Event21!$D:$D, D25) + COUNTIF(Event22!$D:$D, D25) + COUNTIF(Event23!$D:$D, D25) + COUNTIF(Event24!$D:$D, D25) + COUNTIF(Event25!$D:$D, D25) + 0","v":8},{"$f":"IF(D25=\"\", \"\", IF(IFERROR(VLOOKUP(D25, Dues!D:D, 1, FALSE), \"\")=\"\", \"No\", \"Yes\"))","v":"Yes"},{"$f":"IF(D25=\"\", \"\", IF(IFERROR(VLOOKUP(D25, Interview!D:D, 1, FALSE), \"\")<>\"\", \"Yes\", IF(OR(C25=\"Fr\", C25=\"So\", AND(C25=\"Sr\", TODAY()<43646)), \"N/A\", \"No\")))","v":"Yes"}]
["Alyssa","Lombardo","Sr","ajl5753",{"$f":"COUNTIF(Event1!$D:$D, D26) + COUNTIF(Event2!$D:$D, D26) + COUNTIF(Event3!$D:$D, D26) + COUNTIF(Event4!$D:$D, D26) + COUNTIF(Event5!$D:$D, D26) + COUNTIF(Event6!$D:$D, D26) + COUNTIF(Event7!$D:$D, D26) + COUNTIF(Event8!$D:$D, D26) + COUNTIF(Event9!$D:$D, D26) + COUNTIF(Event10!$D:$D, D26) + COUNTIF(Event11!$D:$D, D26) + COUNTIF(Event12!$D:$D, D26) + COUNTIF(Event13!$D:$D, D26) + COUNTIF(Event14!$D:$D, D26) + COUNTIF(Event15!$D:$D, D26) + COUNTIF(Event16!$D:$D, D26) + COUNTIF(Event17!$D:$D, D26) + COUNTIF(Event18!$D:$D, D26) + COUNTIF(Event19!$D:$D, D26) + COUNTIF(Event20!$D:$D, D26) + COUNTIF(Event21!$D:$D, D26) + COUNTIF(Event22!$D:$D, D26) + COUNTIF(Event23!$D:$D, D26) + COUNTIF(Event24!$D:$D, D26) + COUNTIF(Event25!$D:$D, D26) + 0","v":8},{"$f":"IF(D26=\"\", \"\", IF(IFERROR(VLOOKUP(D26, Dues!D:D, 1, FALSE), \"\")=\"\", \"No\", \"Yes\"))","v":"No"},{"$f":"IF(D26=\"\", \"\", IF(IFERROR(VLOOKUP(D26, Interview!D:D, 1, FALSE), \"\")<>\"\", \"Yes\", IF(OR(C26=\"Fr\", C26=\"So\", AND(C26=\"Sr\", TODAY()<43646)), \"N/A\", \"No\")))","v":"N/A"}]
["Allison","Seibert","Jr","azs6047",{"$f":"COUNTIF(Event1!$D:$D, D27) + COUNTIF(Event2!$D:$D, D27) + COUNTIF(Event3!$D:$D, D27) + COUNTIF(Event4!$D:$D, D27) + COUNTIF(Event5!$D:$D, D27) + COUNTIF(Event6!$D:$D, D27) + COUNTIF(Event7!$D:$D, D27) + COUNTIF(Event8!$D:$D, D27) + COUNTIF(Event9!$D:$D, D27) + COUNTIF(Event10!$D:$D, D27) + COUNTIF(Event11!$D:$D, D27) + COUNTIF(Event12!$D:$D, D27) + COUNTIF(Event13!$D:$D, D27) + COUNTIF(Event14!$D:$D, D27) + COUNTIF(Event15!$D:$D, D27) + COUNTIF(Event16!$D:$D, D27) + COUNTIF(Event17!$D:$D, D27) + COUNTIF(Event18!$D:$D, D27) + COUNTIF(Event19!$D:$D, D27) + COUNTIF(Event20!$D:$D, D27) + COUNTIF(Event21!$D:$D, D27) + COUNTIF(Event22!$D:$D, D27) + COUNTIF(Event23!$D:$D, D27) + COUNTIF(Event24!$D:$D, D27) + COUNTIF(Event25!$D:$D, D27) + 0","v":8},{"$f":"IF(D27=\"\", \"\", IF(IFERROR(VLOOKUP(D27, Dues!D:D, 1, FALSE), \"\")=\"\", \"No\", \"Yes\"))","v":"Yes"},{"$f":"IF(D27=\"\", \"\", IF(IFERROR(VLOOKUP(D27, Interview!D:D, 1, FALSE), \"\")<>\"\", \"Yes\", IF(OR(C27=\"Fr\", C27=\"So\", AND(C27=\"Sr\", TODAY()<43646)), \"N/A\", \"No\")))","v":"Yes"}]
["Atharv","Gupte","Jr","abg5424",{"$f":"COUNTIF(Event1!$D:$D, D28) + COUNTIF(Event2!$D:$D, D28) + COUNTIF(Event3!$D:$D, D28) + COUNTIF(Event4!$D:$D, D28) + COUNTIF(Event5!$D:$D, D28) + COUNTIF(Event6!$D:$D, D28) + COUNTIF(Event7!$D:$D, D28) + COUNTIF(Event8!$D:$D, D28) + COUNTIF(Event9!$D:$D, D28) + COUNTIF(Event10!$D:$D, D28) + COUNTIF(Event11!$D:$D, D28) + COUNTIF(Event12!$D:$D, D28) + COUNTIF(Event13!$D:$D, D28) + COUNTIF(Event14!$D:$D, D28) + COUNTIF(Event15!$D:$D, D28) + COUNTIF(Event16!$D:$D, D28) + COUNTIF(Event17!$D:$D, D28) + COUNTIF(Event18!$D:$D, D28) + COUNTIF(Event19!$D:$D, D28) + COUNTIF(Event20!$D:$D, D28) + COUNTIF(Event21!$D:$D, D28) + COUNTIF(Event22!$D:$D, D28) + COUNTIF(Event23!$D:$D, D28) + COUNTIF(Event24!$D:$D, D28) + COUNTIF(Event25!$D:$D, D28) + 0","v":8},{"$f":"IF(D28=\"\", \"\", IF(IFERROR(VLOOKUP(D28, Dues!D:D, 1, FALSE), \"\")=\"\", \"No\", \"Yes\"))","v":"Yes"},{"$f":"IF(D28=\"\", \"\", IF(IFERROR(VLOOKUP(D28, Interview!D:D, 1, FALSE), \"\")<>\"\", \"Yes\", IF(OR(C28=\"Fr\", C28=\"So\", AND(C28=\"Sr\", TODAY()<43646)), \"N/A\", \"No\")))","v":"Yes"}]
["Akram","Khan","Sr","ayk5511",{"$f":"COUNTIF(Event1!$D:$D, D29) + COUNTIF(Event2!$D:$D, D29) + COUNTIF(Event3!$D:$D, D29) + COUNTIF(Event4!$D:$D, D29) + COUNTIF(Event5!$D:$D, D29) + COUNTIF(Event6!$D:$D, D29) + COUNTIF(Event7!$D:$D, D29) + COUNTIF(Event8!$D:$D, D29) + COUNTIF(Event9!$D:$D, D29) + COUNTIF(Event10!$D:$D, D29) + COUNTIF(Event11!$D:$D, D29) + COUNTIF(Event12!$D:$D, D29) + COUNTIF(Event13!$D:$D, D29) + COUNTIF(Event14!$D:$D, D29) + COUNTIF(Event15!$D:$D, D29) + COUNTIF(Event16!$D:$D, D29) + COUNTIF(Event17!$D:$D, D29) + COUNTIF(Event18!$D:$D, D29) + COUNTIF(Event19!$D:$D, D29) + COUNTIF(Event20!$D:$D, D29) + COUNTIF(Event21!$D:$D, D29) + COUNTIF(Event22!$D:$D, D29) + COUNTIF(Event23!$D:$D, D29) + COUNTIF(Event24!$D:$D, D29) + COUNTIF(Event25!$D:$D, D29) + 0","v":8},{"$f":"IF(D29=\"\", \"\", IF(IFERROR(VLOOKUP(D29, Dues!D:D, 1, FALSE), \"\")=\"\", \"No\", \"Yes\"))","v":"No"},{"$f":"IF(D29=\"\", \"\", IF(IFERROR(VLOOKUP(D29, Interview!D:D, 1, FALSE), \"\")<>\"\", \"Yes\", IF(OR(C29=\"Fr\", C29=\"So\", AND(C29=\"Sr\", TODAY()<43646)), \"N/A\", \"No\")))","v":"N/A"}]
["Marceli","Pawlikowski","So","mzp5569",{"$f":"COUNTIF(Event1!$D:$D, D30) + COUNTIF(Event2!$D:$D, D30) + COUNTIF(Event3!$D:$D, D30) + COUNTIF(Event4!$D:$D, D30) + COUNTIF(Event5!$D:$D, D30) + COUNTIF(Event6!$D:$D, D30) + COUNTIF(Event7!$D:$D, D30) + COUNTIF(Event8!$D:$D, D30) + COUNTIF(Event9!$D:$D, D30) + COUNTIF(Event10!$D:$D, D30) + COUNTIF(Event11!$D:$D, D30) + COUNTIF(Event12!$D:$D, D30) + COUNTIF(Event13!$D:$D, D30) + COUNTIF(Event14!$D:$D, D30) + COUNTIF(Event15!$D:$D, D30) + COUNTIF(Event16!$D:$D, D30) + COUNTIF(Event17!$D:$D, D30) + COUNTIF(Event18!$D:$D, D30) + COUNTIF(Event19!$D:$D, D30) + COUNTIF(Event20!$D:$D, D30) + COUNTIF(Event21!$D:$D, D30) + COUNTIF(Event22!$D:$D, D30) + COUNTIF(Event23!$D:$D, D30) + COUNTIF(Event24!$D:$D, D30) + COUNTIF(Event25!$D:$D, D30) + 0","v":8},{"$f":"IF(D30=\"\", \"\", IF(IFERROR(VLOOKUP(D30, Dues!D:D, 1, FALSE), \"\")=\"\", \"No\", \"Yes\"))","v":"No"},{"$f":"IF(D30=\"\", \"\", IF(IFERROR(VLOOKUP(D30, Interview!D:D, 1, FALSE), \"\")<>\"\", \"Yes\", IF(OR(C30=\"Fr\", C30=\"So\", AND(C30=\"Sr\", TODAY()<43646)), \"N/A\", \"No\")))","v":"N/A"}]
["O'Connell","Collin","So","cpo5122",{"$f":"COUNTIF(Event1!$D:$D, D31) + COUNTIF(Event2!$D:$D, D31) + COUNTIF(Event3!$D:$D, D31) + COUNTIF(Event4!$D:$D, D31) + COUNTIF(Event5!$D:$D, D31) + COUNTIF(Event6!$D:$D, D31) + COUNTIF(Event7!$D:$D, D31) + COUNTIF(Event8!$D:$D, D31) + COUNTIF(Event9!$D:$D, D31) + COUNTIF(Event10!$D:$D, D31) + COUNTIF(Event11!$D:$D, D31) + COUNTIF(Event12!$D:$D, D31) + COUNTIF(Event13!$D:$D, D31) + COUNTIF(Event14!$D:$D, D31) + COUNTIF(Event15!$D:$D, D31) + COUNTIF(Event16!$D:$D, D31) + COUNTIF(Event17!$D:$D, D31) + COUNTIF(Event18!$D:$D, D31) + COUNTIF(Event19!$D:$D, D31) + COUNTIF(Event20!$D:$D, D31) + COUNTIF(Event21!$D:$D, D31) + COUNTIF(Event22!$D:$D, D31) + COUNTIF(Event23!$D:$D, D31) + COUNTIF(Event24!$D:$D, D31) + COUNTIF(Event25!$D:$D, D31) + 0","v":7},{"$f":"IF(D31=\"\", \"\", IF(IFERROR(VLOOKUP(D31, Dues!D:D, 1, FALSE), \"\")=\"\", \"No\", \"Yes\"))","v":"Yes"},{"$f":"IF(D31=\"\", \"\", IF(IFERROR(VLOOKUP(D31, Interview!D:D, 1, FALSE), \"\")<>\"\", \"Yes\", IF(OR(C31=\"Fr\", C31=\"So\", AND(C31=\"Sr\", TODAY()<43646)), \"N/A\", \"No\")))","v":"N/A"}]
["Kelly","Waters","So","kfw5153",{"$f":"COUNTIF(Event1!$D:$D, D32) + COUNTIF(Event2!$D:$D, D32) + COUNTIF(Event3!$D:$D, D32) + COUNTIF(Event4!$D:$D, D32) + COUNTIF(Event5!$D:$D, D32) + COUNTIF(Event6!$D:$D, D32) + COUNTIF(Event7!$D:$D, D32) + COUNTIF(Event8!$D:$D, D32) + COUNTIF(Event9!$D:$D, D32) + COUNTIF(Event10!$D:$D, D32) + COUNTIF(Event11!$D:$D, D32) + COUNTIF(Event12!$D:$D, D32) + COUNTIF(Event13!$D:$D, D32) + COUNTIF(Event14!$D:$D, D32) + COUNTIF(Event15!$D:$D, D32) + COUNTIF(Event16!$D:$D, D32) + COUNTIF(Event17!$D:$D, D32) + COUNTIF(Event18!$D:$D, D32) + COUNTIF(Event19!$D:$D, D32) + COUNTIF(Event20!$D:$D, D32) + COUNTIF(Event21!$D:$D, D32) + COUNTIF(Event22!$D:$D, D32) + COUNTIF(Event23!$D:$D, D32) + COUNTIF(Event24!$D:$D, D32) + COUNTIF(Event25!$D:$D, D32) + 0","v":7},{"$f":"IF(D32=\"\", \"\", IF(IFERROR(VLOOKUP(D32, Dues!D:D, 1, FALSE), \"\")=\"\", \"No\", \"Yes\"))","v":"Yes"},{"$f":"IF(D32=\"\", \"\", IF(IFERROR(VLOOKUP(D32, Interview!D:D, 1, FALSE), \"\")<>\"\", \"Yes\", IF(OR(C32=\"Fr\", C32=\"So\", AND(C32=\"Sr\", TODAY()<43646)), \"N/A\", \"No\")))","v":"N/A"}]
["Aidan","Lake","So","arl5600",{"$f":"COUNTIF(Event1!$D:$D, D33) + COUNTIF(Event2!$D:$D, D33) + COUNTIF(Event3!$D:$D, D33) + COUNTIF(Event4!$D:$D, D33) + COUNTIF(Event5!$D:$D, D33) + COUNTIF(Event6!$D:$D, D33) + COUNTIF(Event7!$D:$D, D33) + COUNTIF(Event8!$D:$D, D33) + COUNTIF(Event9!$D:$D, D33) + COUNTIF(Event10!$D:$D, D33) + COUNTIF(Event11!$D:$D, D33) + COUNTIF(Event12!$D:$D, D33) + COUNTIF(Event13!$D:$D, D33) + COUNTIF(Event14!$D:$D, D33) + COUNTIF(Event15!$D:$D, D33) + COUNTIF(Event16!$D:$D, D33) + COUNTIF(Event17!$D:$D, D33) + COUNTIF(Event18!$D:$D, D33) + COUNTIF(Event19!$D:$D, D33) + COUNTIF(Event20!$D:$D, D33) + COUNTIF(Event21!$D:$D, D33) + COUNTIF(Event22!$D:$D, D33) + COUNTIF(Event23!$D:$D, D33) + COUNTIF(Event24!$D:$D, D33) + COUNTIF(Event25!$D:$D, D33) + 0","v":7},{"$f":"IF(D33=\"\", \"\", IF(IFERROR(VLOOKUP(D33, Dues!D:D, 1, FALSE), \"\")=\"\", \"No\", \"Yes\"))","v":"Yes"},{"$f":"IF(D33=\"\", \"\", IF(IFERROR(VLOOKUP(D33, Interview!D:D, 1, FALSE), \"\")<>\"\", \"Yes\", IF(OR(C33=\"Fr\", C33=\"So\", AND(C33=\"Sr\", TODAY()<43646)), \"N/A\", \"No\")))","v":"N/A"}]
["Paul","Birch","Sr","pvb5171",{"$f":"COUNTIF(Event1!$D:$D, D34) + COUNTIF(Event2!$D:$D, D34) + COUNTIF(Event3!$D:$D, D34) + COUNTIF(Event4!$D:$D, D34) + COUNTIF(Event5!$D:$D, D34) + COUNTIF(Event6!$D:$D, D34) + COUNTIF(Event7!$D:$D, D34) + COUNTIF(Event8!$D:$D, D34) + COUNTIF(Event9!$D:$D, D34) + COUNTIF(Event10!$D:$D, D34) + COUNTIF(Event11!$D:$D, D34) + COUNTIF(Event12!$D:$D, D34) + COUNTIF(Event13!$D:$D, D34) + COUNTIF(Event14!$D:$D, D34) + COUNTIF(Event15!$D:$D, D34) + COUNTIF(Event16!$D:$D, D34) + COUNTIF(Event17!$D:$D, D34) + COUNTIF(Event18!$D:$D, D34) + COUNTIF(Event19!$D:$D, D34) + COUNTIF(Event20!$D:$D, D34) + COUNTIF(Event21!$D:$D, D34) + COUNTIF(Event22!$D:$D, D34) + COUNTIF(Event23!$D:$D, D34) + COUNTIF(Event24!$D:$D, D34) + COUNTIF(Event25!$D:$D, D34) + 0","v":7},{"$f":"IF(D34=\"\", \"\", IF(IFERROR(VLOOKUP(D34, Dues!D:D, 1, FALSE), \"\")=\"\", \"No\", \"Yes\"))","v":"Yes"},{"$f":"IF(D34=\"\", \"\", IF(IFERROR(VLOOKUP(D34, Interview!D:D, 1, FALSE), \"\")<>\"\", \"Yes\", IF(OR(C34=\"Fr\", C34=\"So\", AND(C34=\"Sr\", TODAY()<43646)), \"N/A\", \"No\")))","v":"N/A"}]
["Caroline","Johnson","Jr","crj5193",{"$f":"COUNTIF(Event1!$D:$D, D35) + COUNTIF(Event2!$D:$D, D35) + COUNTIF(Event3!$D:$D, D35) + COUNTIF(Event4!$D:$D, D35) + COUNTIF(Event5!$D:$D, D35) + COUNTIF(Event6!$D:$D, D35) + COUNTIF(Event7!$D:$D, D35) + COUNTIF(Event8!$D:$D, D35) + COUNTIF(Event9!$D:$D, D35) + COUNTIF(Event10!$D:$D, D35) + COUNTIF(Event11!$D:$D, D35) + COUNTIF(Event12!$D:$D, D35) + COUNTIF(Event13!$D:$D, D35) + COUNTIF(Event14!$D:$D, D35) + COUNTIF(Event15!$D:$D, D35) + COUNTIF(Event16!$D:$D, D35) + COUNTIF(Event17!$D:$D, D35) + COUNTIF(Event18!$D:$D, D35) + COUNTIF(Event19!$D:$D, D35) + COUNTIF(Event20!$D:$D, D35) + COUNTIF(Event21!$D:$D, D35) + COUNTIF(Event22!$D:$D, D35) + COUNTIF(Event23!$D:$D, D35) + COUNTIF(Event24!$D:$D, D35) + COUNTIF(Event25!$D:$D, D35) + 0","v":7},{"$f":"IF(D35=\"\", \"\", IF(IFERROR(VLOOKUP(D35, Dues!D:D, 1, FALSE), \"\")=\"\", \"No\", \"Yes\"))","v":"Yes"},{"$f":"IF(D35=\"\", \"\", IF(IFERROR(VLOOKUP(D35, Interview!D:D, 1, FALSE), \"\")<>\"\", \"Yes\", IF(OR(C35=\"Fr\", C35=\"So\", AND(C35=\"Sr\", TODAY()<43646)), \"N/A\", \"No\")))","v":"Yes"}]
["Michael","Roby","Jr","msr5385",{"$f":"COUNTIF(Event1!$D:$D, D36) + COUNTIF(Event2!$D:$D, D36) + COUNTIF(Event3!$D:$D, D36) + COUNTIF(Event4!$D:$D, D36) + COUNTIF(Event5!$D:$D, D36) + COUNTIF(Event6!$D:$D, D36) + COUNTIF(Event7!$D:$D, D36) + COUNTIF(Event8!$D:$D, D36) + COUNTIF(Event9!$D:$D, D36) + COUNTIF(Event10!$D:$D, D36) + COUNTIF(Event11!$D:$D, D36) + COUNTIF(Event12!$D:$D, D36) + COUNTIF(Event13!$D:$D, D36) + COUNTIF(Event14!$D:$D, D36) + COUNTIF(Event15!$D:$D, D36) + COUNTIF(Event16!$D:$D, D36) + COUNTIF(Event17!$D:$D, D36) + COUNTIF(Event18!$D:$D, D36) + COUNTIF(Event19!$D:$D, D36) + COUNTIF(Event20!$D:$D, D36) + COUNTIF(Event21!$D:$D, D36) + COUNTIF(Event22!$D:$D, D36) + COUNTIF(Event23!$D:$D, D36) + COUNTIF(Event24!$D:$D, D36) + COUNTIF(Event25!$D:$D, D36) + 0","v":7},{"$f":"IF(D36=\"\", \"\", IF(IFERROR(VLOOKUP(D36, Dues!D:D, 1, FALSE), \"\")=\"\", \"No\", \"Yes\"))","v":"Yes"},{"$f":"IF(D36=\"\", \"\", IF(IFERROR(VLOOKUP(D36, Interview!D:D, 1, FALSE), \"\")<>\"\", \"Yes\", IF(OR(C36=\"Fr\", C36=\"So\", AND(C36=\"Sr\", TODAY()<43646)), \"N/A\", \"No\")))","v":"Yes"}]
["Elysia","Liu","Jr","yxl482",{"$f":"COUNTIF(Event1!$D:$D, D37) + COUNTIF(Event2!$D:$D, D37) + COUNTIF(Event3!$D:$D, D37) + COUNTIF(Event4!$D:$D, D37) + COUNTIF(Event5!$D:$D, D37) + COUNTIF(Event6!$D:$D, D37) + COUNTIF(Event7!$D:$D, D37) + COUNTIF(Event8!$D:$D, D37) + COUNTIF(Event9!$D:$D, D37) + COUNTIF(Event10!$D:$D, D37) + COUNTIF(Event11!$D:$D, D37) + COUNTIF(Event12!$D:$D, D37) + COUNTIF(Event13!$D:$D, D37) + COUNTIF(Event14!$D:$D, D37) + COUNTIF(Event15!$D:$D, D37) + COUNTIF(Event16!$D:$D, D37) + COUNTIF(Event17!$D:$D, D37) + COUNTIF(Event18!$D:$D, D37) + COUNTIF(Event19!$D:$D, D37) + COUNTIF(Event20!$D:$D, D37) + COUNTIF(Event21!$D:$D, D37) + COUNTIF(Event22!$D:$D, D37) + COUNTIF(Event23!$D:$D, D37) + COUNTIF(Event24!$D:$D, D37) + COUNTIF(Event25!$D:$D, D37) + 0","v":7},{"$f":"IF(D37=\"\", \"\", IF(IFERROR(VLOOKUP(D37, Dues!D:D, 1, FALSE), \"\")=\"\", \"No\", \"Yes\"))","v":"Yes"},{"$f":"IF(D37=\"\", \"\", IF(IFERROR(VLOOKUP(D37, Interview!D:D, 1, FALSE), \"\")<>\"\", \"Yes\", IF(OR(C37=\"Fr\", C37=\"So\", AND(C37=\"Sr\", TODAY()<43646)), \"N/A\", \"No\")))","v":"Yes"}]
["Troy","Harro","Jr","tbh5102",{"$f":"COUNTIF(Event1!$D:$D, D38) + COUNTIF(Event2!$D:$D, D38) + COUNTIF(Event3!$D:$D, D38) + COUNTIF(Event4!$D:$D, D38) + COUNTIF(Event5!$D:$D, D38) + COUNTIF(Event6!$D:$D, D38) + COUNTIF(Event7!$D:$D, D38) + COUNTIF(Event8!$D:$D, D38) + COUNTIF(Event9!$D:$D, D38) + COUNTIF(Event10!$D:$D, D38) + COUNTIF(Event11!$D:$D, D38) + COUNTIF(Event12!$D:$D, D38) + COUNTIF(Event13!$D:$D, D38) + COUNTIF(Event14!$D:$D, D38) + COUNTIF(Event15!$D:$D, D38) + COUNTIF(Event16!$D:$D, D38) + COUNTIF(Event17!$D:$D, D38) + COUNTIF(Event18!$D:$D, D38) + COUNTIF(Event19!$D:$D, D38) + COUNTIF(Event20!$D:$D, D38) + COUNTIF(Event21!$D:$D, D38) + COUNTIF(Event22!$D:$D, D38) + COUNTIF(Event23!$D:$D, D38) + COUNTIF(Event24!$D:$D, D38) + COUNTIF(Event25!$D:$D, D38) + 0","v":7},{"$f":"IF(D38=\"\", \"\", IF(IFERROR(VLOOKUP(D38, Dues!D:D, 1, FALSE), \"\")=\"\", \"No\", \"Yes\"))","v":"Yes"},{"$f":"IF(D38=\"\", \"\", IF(IFERROR(VLOOKUP(D38, Interview!D:D, 1, FALSE), \"\")<>\"\", \"Yes\", IF(OR(C38=\"Fr\", C38=\"So\", AND(C38=\"Sr\", TODAY()<43646)), \"N/A\", \"No\")))","v":"Yes"}]
["Elizabeth","Simmons","Jr","ems6139",{"$f":"COUNTIF(Event1!$D:$D, D39) + COUNTIF(Event2!$D:$D, D39) + COUNTIF(Event3!$D:$D, D39) + COUNTIF(Event4!$D:$D, D39) + COUNTIF(Event5!$D:$D, D39) + COUNTIF(Event6!$D:$D, D39) + COUNTIF(Event7!$D:$D, D39) + COUNTIF(Event8!$D:$D, D39) + COUNTIF(Event9!$D:$D, D39) + COUNTIF(Event10!$D:$D, D39) + COUNTIF(Event11!$D:$D, D39) + COUNTIF(Event12!$D:$D, D39) + COUNTIF(Event13!$D:$D, D39) + COUNTIF(Event14!$D:$D, D39) + COUNTIF(Event15!$D:$D, D39) + COUNTIF(Event16!$D:$D, D39) + COUNTIF(Event17!$D:$D, D39) + COUNTIF(Event18!$D:$D, D39) + COUNTIF(Event19!$D:$D, D39) + COUNTIF(Event20!$D:$D, D39) + COUNTIF(Event21!$D:$D, D39) + COUNTIF(Event22!$D:$D, D39) + COUNTIF(Event23!$D:$D, D39) + COUNTIF(Event24!$D:$D, D39) + COUNTIF(Event25!$D:$D, D39) + 0","v":7},{"$f":"IF(D39=\"\", \"\", IF(IFERROR(VLOOKUP(D39, Dues!D:D, 1, FALSE), \"\")=\"\", \"No\", \"Yes\"))","v":"Yes"},{"$f":"IF(D39=\"\", \"\", IF(IFERROR(VLOOKUP(D39, Interview!D:D, 1, FALSE), \"\")<>\"\", \"Yes\", IF(OR(C39=\"Fr\", C39=\"So\", AND(C39=\"Sr\", TODAY()<43646)), \"N/A\", \"No\")))","v":"No"}]
["Lu","Huang","Jr","lph5179",{"$f":"COUNTIF(Event1!$D:$D, D40) + COUNTIF(Event2!$D:$D, D40) + COUNTIF(Event3!$D:$D, D40) + COUNTIF(Event4!$D:$D, D40) + COUNTIF(Event5!$D:$D, D40) + COUNTIF(Event6!$D:$D, D40) + COUNTIF(Event7!$D:$D, D40) + COUNTIF(Event8!$D:$D, D40) + COUNTIF(Event9!$D:$D, D40) + COUNTIF(Event10!$D:$D, D40) + COUNTIF(Event11!$D:$D, D40) + COUNTIF(Event12!$D:$D, D40) + COUNTIF(Event13!$D:$D, D40) + COUNTIF(Event14!$D:$D, D40) + COUNTIF(Event15!$D:$D, D40) + COUNTIF(Event16!$D:$D, D40) + COUNTIF(Event17!$D:$D, D40) + COUNTIF(Event18!$D:$D, D40) + COUNTIF(Event19!$D:$D, D40) + COUNTIF(Event20!$D:$D, D40) + COUNTIF(Event21!$D:$D, D40) + COUNTIF(Event22!$D:$D, D40) + COUNTIF(Event23!$D:$D, D40) + COUNTIF(Event24!$D:$D, D40) + COUNTIF(Event25!$D:$D, D40) + 0","v":7},{"$f":"IF(D40=\"\", \"\", IF(IFERROR(VLOOKUP(D40, Dues!D:D, 1, FALSE), \"\")=\"\", \"No\", \"Yes\"))","v":"Yes"},{"$f":"IF(D40=\"\", \"\", IF(IFERROR(VLOOKUP(D40, Interview!D:D, 1, FALSE), \"\")<>\"\", \"Yes\", IF(OR(C40=\"Fr\", C40=\"So\", AND(C40=\"Sr\", TODAY()<43646)), \"N/A\", \"No\")))","v":"No"}]
["Rachel","Sudo","Jr","rbs5427",{"$f":"COUNTIF(Event1!$D:$D, D41) + COUNTIF(Event2!$D:$D, D41) + COUNTIF(Event3!$D:$D, D41) + COUNTIF(Event4!$D:$D, D41) + COUNTIF(Event5!$D:$D, D41) + COUNTIF(Event6!$D:$D, D41) + COUNTIF(Event7!$D:$D, D41) + COUNTIF(Event8!$D:$D, D41) + COUNTIF(Event9!$D:$D, D41) + COUNTIF(Event10!$D:$D, D41) + COUNTIF(Event11!$D:$D, D41) + COUNTIF(Event12!$D:$D, D41) + COUNTIF(Event13!$D:$D, D41) + COUNTIF(Event14!$D:$D, D41) + COUNTIF(Event15!$D:$D, D41) + COUNTIF(Event16!$D:$D, D41) + COUNTIF(Event17!$D:$D, D41) + COUNTIF(Event18!$D:$D, D41) + COUNTIF(Event19!$D:$D, D41) + COUNTIF(Event20!$D:$D, D41) + COUNTIF(Event21!$D:$D, D41) + COUNTIF(Event22!$D:$D, D41) + COUNTIF(Event23!$D:$D, D41) + COUNTIF(Event24!$D:$D, D41) + COUNTIF(Event25!$D:$D, D41) + 0","v":7},{"$f":"IF(D41=\"\", \"\", IF(IFERROR(VLOOKUP(D41, Dues!D:D, 1, FALSE), \"\")=\"\", \"No\", \"Yes\"))","v":"No"},{"$f":"IF(D41=\"\", \"\", IF(IFERROR(VLOOKUP(D41, Interview!D:D, 1, FALSE), \"\")<>\"\", \"Yes\", IF(OR(C41=\"Fr\", C41=\"So\", AND(C41=\"Sr\", TODAY()<43646)), \"N/A\", \"No\")))","v":"Yes"}]
["Jiali","Liu","Sr","jul551",{"$f":"COUNTIF(Event1!$D:$D, D42) + COUNTIF(Event2!$D:$D, D42) + COUNTIF(Event3!$D:$D, D42) + COUNTIF(Event4!$D:$D, D42) + COUNTIF(Event5!$D:$D, D42) + COUNTIF(Event6!$D:$D, D42) + COUNTIF(Event7!$D:$D, D42) + COUNTIF(Event8!$D:$D, D42) + COUNTIF(Event9!$D:$D, D42) + COUNTIF(Event10!$D:$D, D42) + COUNTIF(Event11!$D:$D, D42) + COUNTIF(Event12!$D:$D, D42) + COUNTIF(Event13!$D:$D, D42) + COUNTIF(Event14!$D:$D, D42) + COUNTIF(Event15!$D:$D, D42) + COUNTIF(Event16!$D:$D, D42) + COUNTIF(Event17!$D:$D, D42) + COUNTIF(Event18!$D:$D, D42) + COUNTIF(Event19!$D:$D, D42) + COUNTIF(Event20!$D:$D, D42) + COUNTIF(Event21!$D:$D, D42) + COUNTIF(Event22!$D:$D, D42) + COUNTIF(Event23!$D:$D, D42) + COUNTIF(Event24!$D:$D, D42) + COUNTIF(Event25!$D:$D, D42) + 0","v":7},{"$f":"IF(D42=\"\", \"\", IF(IFERROR(VLOOKUP(D42, Dues!D:D, 1, FALSE), \"\")=\"\", \"No\", \"Yes\"))","v":"No"},{"$f":"IF(D42=\"\", \"\", IF(IFERROR(VLOOKUP(D42, Interview!D:D, 1, FALSE), \"\")<>\"\", \"Yes\", IF(OR(C42=\"Fr\", C42=\"So\", AND(C42=\"Sr\", TODAY()<43646)), \"N/A\", \"No\")))","v":"N/A"}]
["Mingzhang","Yan","Jr","mxy5097",{"$f":"COUNTIF(Event1!$D:$D, D43) + COUNTIF(Event2!$D:$D, D43) + COUNTIF(Event3!$D:$D, D43) + COUNTIF(Event4!$D:$D, D43) + COUNTIF(Event5!$D:$D, D43) + COUNTIF(Event6!$D:$D, D43) + COUNTIF(Event7!$D:$D, D43) + COUNTIF(Event8!$D:$D, D43) + COUNTIF(Event9!$D:$D, D43) + COUNTIF(Event10!$D:$D, D43) + COUNTIF(Event11!$D:$D, D43) + COUNTIF(Event12!$D:$D, D43) + COUNTIF(Event13!$D:$D, D43) + COUNTIF(Event14!$D:$D, D43) + COUNTIF(Event15!$D:$D, D43) + COUNTIF(Event16!$D:$D, D43) + COUNTIF(Event17!$D:$D, D43) + COUNTIF(Event18!$D:$D, D43) + COUNTIF(Event19!$D:$D, D43) + COUNTIF(Event20!$D:$D, D43) + COUNTIF(Event21!$D:$D, D43) + COUNTIF(Event22!$D:$D, D43) + COUNTIF(Event23!$D:$D, D43) + COUNTIF(Event24!$D:$D, D43) + COUNTIF(Event25!$D:$D, D43) + 0","v":7},{"$f":"IF(D43=\"\", \"\", IF(IFERROR(VLOOKUP(D43, Dues!D:D, 1, FALSE), \"\")=\"\", \"No\", \"Yes\"))","v":"No"},{"$f":"IF(D43=\"\", \"\", IF(IFERROR(VLOOKUP(D43, Interview!D:D, 1, FALSE), \"\")<>\"\", \"Yes\", IF(OR(C43=\"Fr\", C43=\"So\", AND(C43=\"Sr\", TODAY()<43646)), \"N/A\", \"No\")))","v":"No"}]
["Aaron","Gersh","Jr","arg5600",{"$f":"COUNTIF(Event1!$D:$D, D44) + COUNTIF(Event2!$D:$D, D44) + COUNTIF(Event3!$D:$D, D44) + COUNTIF(Event4!$D:$D, D44) + COUNTIF(Event5!$D:$D, D44) + COUNTIF(Event6!$D:$D, D44) + COUNTIF(Event7!$D:$D, D44) + COUNTIF(Event8!$D:$D, D44) + COUNTIF(Event9!$D:$D, D44) + COUNTIF(Event10!$D:$D, D44) + COUNTIF(Event11!$D:$D, D44) + COUNTIF(Event12!$D:$D, D44) + COUNTIF(Event13!$D:$D, D44) + COUNTIF(Event14!$D:$D, D44) + COUNTIF(Event15!$D:$D, D44) + COUNTIF(Event16!$D:$D, D44) + COUNTIF(Event17!$D:$D, D44) + COUNTIF(Event18!$D:$D, D44) + COUNTIF(Event19!$D:$D, D44) + COUNTIF(Event20!$D:$D, D44) + COUNTIF(Event21!$D:$D, D44) + COUNTIF(Event22!$D:$D, D44) + COUNTIF(Event23!$D:$D, D44) + COUNTIF(Event24!$D:$D, D44) + COUNTIF(Event25!$D:$D, D44) + 0","v":7},{"$f":"IF(D44=\"\", \"\", IF(IFERROR(VLOOKUP(D44, Dues!D:D, 1, FALSE), \"\")=\"\", \"No\", \"Yes\"))","v":"Yes"},{"$f":"IF(D44=\"\", \"\", IF(IFERROR(VLOOKUP(D44, Interview!D:D, 1, FALSE), \"\")<>\"\", \"Yes\", IF(OR(C44=\"Fr\", C44=\"So\", AND(C44=\"Sr\", TODAY()<43646)), \"N/A\", \"No\")))","v":"Yes"}]
["Kara","Gibbon","Fr","kxg295",{"$f":"COUNTIF(Event1!$D:$D, D45) + COUNTIF(Event2!$D:$D, D45) + COUNTIF(Event3!$D:$D, D45) + COUNTIF(Event4!$D:$D, D45) + COUNTIF(Event5!$D:$D, D45) + COUNTIF(Event6!$D:$D, D45) + COUNTIF(Event7!$D:$D, D45) + COUNTIF(Event8!$D:$D, D45) + COUNTIF(Event9!$D:$D, D45) + COUNTIF(Event10!$D:$D, D45) + COUNTIF(Event11!$D:$D, D45) + COUNTIF(Event12!$D:$D, D45) + COUNTIF(Event13!$D:$D, D45) + COUNTIF(Event14!$D:$D, D45) + COUNTIF(Event15!$D:$D, D45) + COUNTIF(Event16!$D:$D, D45) + COUNTIF(Event17!$D:$D, D45) + COUNTIF(Event18!$D:$D, D45) + COUNTIF(Event19!$D:$D, D45) + COUNTIF(Event20!$D:$D, D45) + COUNTIF(Event21!$D:$D, D45) + COUNTIF(Event22!$D:$D, D45) + COUNTIF(Event23!$D:$D, D45) + COUNTIF(Event24!$D:$D, D45) + COUNTIF(Event25!$D:$D, D45) + 0","v":6},{"$f":"IF(D45=\"\", \"\", IF(IFERROR(VLOOKUP(D45, Dues!D:D, 1, FALSE), \"\")=\"\", \"No\", \"Yes\"))","v":"Yes"},{"$f":"IF(D45=\"\", \"\", IF(IFERROR(VLOOKUP(D45, Interview!D:D, 1, FALSE), \"\")<>\"\", \"Yes\", IF(OR(C45=\"Fr\", C45=\"So\", AND(C45=\"Sr\", TODAY()<43646)), \"N/A\", \"No\")))","v":"N/A"}]
["Brooke","Barrett","Sr","blb5681",{"$f":"COUNTIF(Event1!$D:$D, D46) + COUNTIF(Event2!$D:$D, D46) + COUNTIF(Event3!$D:$D, D46) + COUNTIF(Event4!$D:$D, D46) + COUNTIF(Event5!$D:$D, D46) + COUNTIF(Event6!$D:$D, D46) + COUNTIF(Event7!$D:$D, D46) + COUNTIF(Event8!$D:$D, D46) + COUNTIF(Event9!$D:$D, D46) + COUNTIF(Event10!$D:$D, D46) + COUNTIF(Event11!$D:$D, D46) + COUNTIF(Event12!$D:$D, D46) + COUNTIF(Event13!$D:$D, D46) + COUNTIF(Event14!$D:$D, D46) + COUNTIF(Event15!$D:$D, D46) + COUNTIF(Event16!$D:$D, D46) + COUNTIF(Event17!$D:$D, D46) + COUNTIF(Event18!$D:$D, D46) + COUNTIF(Event19!$D:$D, D46) + COUNTIF(Event20!$D:$D, D46) + COUNTIF(Event21!$D:$D, D46) + COUNTIF(Event22!$D:$D, D46) + COUNTIF(Event23!$D:$D, D46) + COUNTIF(Event24!$D:$D, D46) + COUNTIF(Event25!$D:$D, D46) + 0","v":6},{"$f":"IF(D46=\"\", \"\", IF(IFERROR(VLOOKUP(D46, Dues!D:D, 1, FALSE), \"\")=\"\", \"No\", \"Yes\"))","v":"Yes"},{"$f":"IF(D46=\"\", \"\", IF(IFERROR(VLOOKUP(D46, Interview!D:D, 1, FALSE), \"\")<>\"\", \"Yes\", IF(OR(C46=\"Fr\", C46=\"So\", AND(C46=\"Sr\", TODAY()<43646)), \"N/A\", \"No\")))","v":"N/A"}]
["Jiasheng","Pan","Jr","jmp6546",{"$f":"COUNTIF(Event1!$D:$D, D47) + COUNTIF(Event2!$D:$D, D47) + COUNTIF(Event3!$D:$D, D47) + COUNTIF(Event4!$D:$D, D47) + COUNTIF(Event5!$D:$D, D47) + COUNTIF(Event6!$D:$D, D47) + COUNTIF(Event7!$D:$D, D47) + COUNTIF(Event8!$D:$D, D47) + COUNTIF(Event9!$D:$D, D47) + COUNTIF(Event10!$D:$D, D47) + COUNTIF(Event11!$D:$D, D47) + COUNTIF(Event12!$D:$D, D47) + COUNTIF(Event13!$D:$D, D47) + COUNTIF(Event14!$D:$D, D47) + COUNTIF(Event15!$D:$D, D47) + COUNTIF(Event16!$D:$D, D47) + COUNTIF(Event17!$D:$D, D47) + COUNTIF(Event18!$D:$D, D47) + COUNTIF(Event19!$D:$D, D47) + COUNTIF(Event20!$D:$D, D47) + COUNTIF(Event21!$D:$D, D47) + COUNTIF(Event22!$D:$D, D47) + COUNTIF(Event23!$D:$D, D47) + COUNTIF(Event24!$D:$D, D47) + COUNTIF(Event25!$D:$D, D47) + 0","v":6},{"$f":"IF(D47=\"\", \"\", IF(IFERROR(VLOOKUP(D47, Dues!D:D, 1, FALSE), \"\")=\"\", \"No\", \"Yes\"))","v":"Yes"},{"$f":"IF(D47=\"\", \"\", IF(IFERROR(VLOOKUP(D47, Interview!D:D, 1, FALSE), \"\")<>\"\", \"Yes\", IF(OR(C47=\"Fr\", C47=\"So\", AND(C47=\"Sr\", TODAY()<43646)), \"N/A\", \"No\")))","v":"No"}]
["Rohan","Bhandarkar ","Jr","rpb5416",{"$f":"COUNTIF(Event1!$D:$D, D48) + COUNTIF(Event2!$D:$D, D48) + COUNTIF(Event3!$D:$D, D48) + COUNTIF(Event4!$D:$D, D48) + COUNTIF(Event5!$D:$D, D48) + COUNTIF(Event6!$D:$D, D48) + COUNTIF(Event7!$D:$D, D48) + COUNTIF(Event8!$D:$D, D48) + COUNTIF(Event9!$D:$D, D48) + COUNTIF(Event10!$D:$D, D48) + COUNTIF(Event11!$D:$D, D48) + COUNTIF(Event12!$D:$D, D48) + COUNTIF(Event13!$D:$D, D48) + COUNTIF(Event14!$D:$D, D48) + COUNTIF(Event15!$D:$D, D48) + COUNTIF(Event16!$D:$D, D48) + COUNTIF(Event17!$D:$D, D48) + COUNTIF(Event18!$D:$D, D48) + COUNTIF(Event19!$D:$D, D48) + COUNTIF(Event20!$D:$D, D48) + COUNTIF(Event21!$D:$D, D48) + COUNTIF(Event22!$D:$D, D48) + COUNTIF(Event23!$D:$D, D48) + COUNTIF(Event24!$D:$D, D48) + COUNTIF(Event25!$D:$D, D48) + 0","v":6},{"$f":"IF(D48=\"\", \"\", IF(IFERROR(VLOOKUP(D48, Dues!D:D, 1, FALSE), \"\")=\"\", \"No\", \"Yes\"))","v":"Yes"},{"$f":"IF(D48=\"\", \"\", IF(IFERROR(VLOOKUP(D48, Interview!D:D, 1, FALSE), \"\")<>\"\", \"Yes\", IF(OR(C48=\"Fr\", C48=\"So\", AND(C48=\"Sr\", TODAY()<43646)), \"N/A\", \"No\")))","v":"Yes"}]
["Birch","Vince","Fr","vpb5085",{"$f":"COUNTIF(Event1!$D:$D, D49) + COUNTIF(Event2!$D:$D, D49) + COUNTIF(Event3!$D:$D, D49) + COUNTIF(Event4!$D:$D, D49) + COUNTIF(Event5!$D:$D, D49) + COUNTIF(Event6!$D:$D, D49) + COUNTIF(Event7!$D:$D, D49) + COUNTIF(Event8!$D:$D, D49) + COUNTIF(Event9!$D:$D, D49) + COUNTIF(Event10!$D:$D, D49) + COUNTIF(Event11!$D:$D, D49) + COUNTIF(Event12!$D:$D, D49) + COUNTIF(Event13!$D:$D, D49) + COUNTIF(Event14!$D:$D, D49) + COUNTIF(Event15!$D:$D, D49) + COUNTIF(Event16!$D:$D, D49) + COUNTIF(Event17!$D:$D, D49) + COUNTIF(Event18!$D:$D, D49) + COUNTIF(Event19!$D:$D, D49) + COUNTIF(Event20!$D:$D, D49) + COUNTIF(Event21!$D:$D, D49) + COUNTIF(Event22!$D:$D, D49) + COUNTIF(Event23!$D:$D, D49) + COUNTIF(Event24!$D:$D, D49) + COUNTIF(Event25!$D:$D, D49) + 0","v":6},{"$f":"IF(D49=\"\", \"\", IF(IFERROR(VLOOKUP(D49, Dues!D:D, 1, FALSE), \"\")=\"\", \"No\", \"Yes\"))","v":"Yes"},{"$f":"IF(D49=\"\", \"\", IF(IFERROR(VLOOKUP(D49, Interview!D:D, 1, FALSE), \"\")<>\"\", \"Yes\", IF(OR(C49=\"Fr\", C49=\"So\", AND(C49=\"Sr\", TODAY()<43646)), \"N/A\", \"No\")))","v":"N/A"}]
["Danielle","Jameison","Sr","dkj5101",{"$f":"COUNTIF(Event1!$D:$D, D50) + COUNTIF(Event2!$D:$D, D50) + COUNTIF(Event3!$D:$D, D50) + COUNTIF(Event4!$D:$D, D50) + COUNTIF(Event5!$D:$D, D50) + COUNTIF(Event6!$D:$D, D50) + COUNTIF(Event7!$D:$D, D50) + COUNTIF(Event8!$D:$D, D50) + COUNTIF(Event9!$D:$D, D50) + COUNTIF(Event10!$D:$D, D50) + COUNTIF(Event11!$D:$D, D50) + COUNTIF(Event12!$D:$D, D50) + COUNTIF(Event13!$D:$D, D50) + COUNTIF(Event14!$D:$D, D50) + COUNTIF(Event15!$D:$D, D50) + COUNTIF(Event16!$D:$D, D50) + COUNTIF(Event17!$D:$D, D50) + COUNTIF(Event18!$D:$D, D50) + COUNTIF(Event19!$D:$D, D50) + COUNTIF(Event20!$D:$D, D50) + COUNTIF(Event21!$D:$D, D50) + COUNTIF(Event22!$D:$D, D50) + COUNTIF(Event23!$D:$D, D50) + COUNTIF(Event24!$D:$D, D50) + COUNTIF(Event25!$D:$D, D50) + 0","v":6},{"$f":"IF(D50=\"\", \"\", IF(IFERROR(VLOOKUP(D50, Dues!D:D, 1, FALSE), \"\")=\"\", \"No\", \"Yes\"))","v":"Yes"},{"$f":"IF(D50=\"\", \"\", IF(IFERROR(VLOOKUP(D50, Interview!D:D, 1, FALSE), \"\")<>\"\", \"Yes\", IF(OR(C50=\"Fr\", C50=\"So\", AND(C50=\"Sr\", TODAY()<43646)), \"N/A\", \"No\")))","v":"N/A"}]
["Vera","Xia","Sr","xzx5081",{"$f":"COUNTIF(Event1!$D:$D, D51) + COUNTIF(Event2!$D:$D, D51) + COUNTIF(Event3!$D:$D, D51) + COUNTIF(Event4!$D:$D, D51) + COUNTIF(Event5!$D:$D, D51) + COUNTIF(Event6!$D:$D, D51) + COUNTIF(Event7!$D:$D, D51) + COUNTIF(Event8!$D:$D, D51) + COUNTIF(Event9!$D:$D, D51) + COUNTIF(Event10!$D:$D, D51) + COUNTIF(Event11!$D:$D, D51) + COUNTIF(Event12!$D:$D, D51) + COUNTIF(Event13!$D:$D, D51) + COUNTIF(Event14!$D:$D, D51) + COUNTIF(Event15!$D:$D, D51) + COUNTIF(Event16!$D:$D, D51) + COUNTIF(Event17!$D:$D, D51) + COUNTIF(Event18!$D:$D, D51) + COUNTIF(Event19!$D:$D, D51) + COUNTIF(Event20!$D:$D, D51) + COUNTIF(Event21!$D:$D, D51) + COUNTIF(Event22!$D:$D, D51) + COUNTIF(Event23!$D:$D, D51) + COUNTIF(Event24!$D:$D, D51) + COUNTIF(Event25!$D:$D, D51) + 0","v":6},{"$f":"IF(D51=\"\", \"\", IF(IFERROR(VLOOKUP(D51, Dues!D:D, 1, FALSE), \"\")=\"\", \"No\", \"Yes\"))","v":"Yes"},{"$f":"IF(D51=\"\", \"\", IF(IFERROR(VLOOKUP(D51, Interview!D:D, 1, FALSE), \"\")<>\"\", \"Yes\", IF(OR(C51=\"Fr\", C51=\"So\", AND(C51=\"Sr\", TODAY()<43646)), \"N/A\", \"No\")))","v":"N/A"}]
["Akash","Patel","So","axp428",{"$f":"COUNTIF(Event1!$D:$D, D52) + COUNTIF(Event2!$D:$D, D52) + COUNTIF(Event3!$D:$D, D52) + COUNTIF(Event4!$D:$D, D52) + COUNTIF(Event5!$D:$D, D52) + COUNTIF(Event6!$D:$D, D52) + COUNTIF(Event7!$D:$D, D52) + COUNTIF(Event8!$D:$D, D52) + COUNTIF(Event9!$D:$D, D52) + COUNTIF(Event10!$D:$D, D52) + COUNTIF(Event11!$D:$D, D52) + COUNTIF(Event12!$D:$D, D52) + COUNTIF(Event13!$D:$D, D52) + COUNTIF(Event14!$D:$D, D52) + COUNTIF(Event15!$D:$D, D52) + COUNTIF(Event16!$D:$D, D52) + COUNTIF(Event17!$D:$D, D52) + COUNTIF(Event18!$D:$D, D52) + COUNTIF(Event19!$D:$D, D52) + COUNTIF(Event20!$D:$D, D52) + COUNTIF(Event21!$D:$D, D52) + COUNTIF(Event22!$D:$D, D52) + COUNTIF(Event23!$D:$D, D52) + COUNTIF(Event24!$D:$D, D52) + COUNTIF(Event25!$D:$D, D52) + 0","v":6},{"$f":"IF(D52=\"\", \"\", IF(IFERROR(VLOOKUP(D52, Dues!D:D, 1, FALSE), \"\")=\"\", \"No\", \"Yes\"))","v":"Yes"},{"$f":"IF(D52=\"\", \"\", IF(IFERROR(VLOOKUP(D52, Interview!D:D, 1, FALSE), \"\")<>\"\", \"Yes\", IF(OR(C52=\"Fr\", C52=\"So\", AND(C52=\"Sr\", TODAY()<43646)), \"N/A\", \"No\")))","v":"Yes"}]
["Margot","California","Jr","mac6866",{"$f":"COUNTIF(Event1!$D:$D, D53) + COUNTIF(Event2!$D:$D, D53) + COUNTIF(Event3!$D:$D, D53) + COUNTIF(Event4!$D:$D, D53) + COUNTIF(Event5!$D:$D, D53) + COUNTIF(Event6!$D:$D, D53) + COUNTIF(Event7!$D:$D, D53) + COUNTIF(Event8!$D:$D, D53) + COUNTIF(Event9!$D:$D, D53) + COUNTIF(Event10!$D:$D, D53) + COUNTIF(Event11!$D:$D, D53) + COUNTIF(Event12!$D:$D, D53) + COUNTIF(Event13!$D:$D, D53) + COUNTIF(Event14!$D:$D, D53) + COUNTIF(Event15!$D:$D, D53) + COUNTIF(Event16!$D:$D, D53) + COUNTIF(Event17!$D:$D, D53) + COUNTIF(Event18!$D:$D, D53) + COUNTIF(Event19!$D:$D, D53) + COUNTIF(Event20!$D:$D, D53) + COUNTIF(Event21!$D:$D, D53) + COUNTIF(Event22!$D:$D, D53) + COUNTIF(Event23!$D:$D, D53) + COUNTIF(Event24!$D:$D, D53) + COUNTIF(Event25!$D:$D, D53) + 0","v":6},{"$f":"IF(D53=\"\", \"\", IF(IFERROR(VLOOKUP(D53, Dues!D:D, 1, FALSE), \"\")=\"\", \"No\", \"Yes\"))","v":"No"},{"$f":"IF(D53=\"\", \"\", IF(IFERROR(VLOOKUP(D53, Interview!D:D, 1, FALSE), \"\")<>\"\", \"Yes\", IF(OR(C53=\"Fr\", C53=\"So\", AND(C53=\"Sr\", TODAY()<43646)), \"N/A\", \"No\")))","v":"Yes"}]
["John","Miller","Jr","jdm6057",{"$f":"COUNTIF(Event1!$D:$D, D54) + COUNTIF(Event2!$D:$D, D54) + COUNTIF(Event3!$D:$D, D54) + COUNTIF(Event4!$D:$D, D54) + COUNTIF(Event5!$D:$D, D54) + COUNTIF(Event6!$D:$D, D54) + COUNTIF(Event7!$D:$D, D54) + COUNTIF(Event8!$D:$D, D54) + COUNTIF(Event9!$D:$D, D54) + COUNTIF(Event10!$D:$D, D54) + COUNTIF(Event11!$D:$D, D54) + COUNTIF(Event12!$D:$D, D54) + COUNTIF(Event13!$D:$D, D54) + COUNTIF(Event14!$D:$D, D54) + COUNTIF(Event15!$D:$D, D54) + COUNTIF(Event16!$D:$D, D54) + COUNTIF(Event17!$D:$D, D54) + COUNTIF(Event18!$D:$D, D54) + COUNTIF(Event19!$D:$D, D54) + COUNTIF(Event20!$D:$D, D54) + COUNTIF(Event21!$D:$D, D54) + COUNTIF(Event22!$D:$D, D54) + COUNTIF(Event23!$D:$D, D54) + COUNTIF(Event24!$D:$D, D54) + COUNTIF(Event25!$D:$D, D54) + 0","v":6},{"$f":"IF(D54=\"\", \"\", IF(IFERROR(VLOOKUP(D54, Dues!D:D, 1, FALSE), \"\")=\"\", \"No\", \"Yes\"))","v":"Yes"},{"$f":"IF(D54=\"\", \"\", IF(IFERROR(VLOOKUP(D54, Interview!D:D, 1, FALSE), \"\")<>\"\", \"Yes\", IF(OR(C54=\"Fr\", C54=\"So\", AND(C54=\"Sr\", TODAY()<43646)), \"N/A\", \"No\")))","v":"Yes"}]
["Siyi","Ma","Jr","sbm5554",{"$f":"COUNTIF(Event1!$D:$D, D55) + COUNTIF(Event2!$D:$D, D55) + COUNTIF(Event3!$D:$D, D55) + COUNTIF(Event4!$D:$D, D55) + COUNTIF(Event5!$D:$D, D55) + COUNTIF(Event6!$D:$D, D55) + COUNTIF(Event7!$D:$D, D55) + COUNTIF(Event8!$D:$D, D55) + COUNTIF(Event9!$D:$D, D55) + COUNTIF(Event10!$D:$D, D55) + COUNTIF(Event11!$D:$D, D55) + COUNTIF(Event12!$D:$D, D55) + COUNTIF(Event13!$D:$D, D55) + COUNTIF(Event14!$D:$D, D55) + COUNTIF(Event15!$D:$D, D55) + COUNTIF(Event16!$D:$D, D55) + COUNTIF(Event17!$D:$D, D55) + COUNTIF(Event18!$D:$D, D55) + COUNTIF(Event19!$D:$D, D55) + COUNTIF(Event20!$D:$D, D55) + COUNTIF(Event21!$D:$D, D55) + COUNTIF(Event22!$D:$D, D55) + COUNTIF(Event23!$D:$D, D55) + COUNTIF(Event24!$D:$D, D55) + COUNTIF(Event25!$D:$D, D55) + 0","v":6},{"$f":"IF(D55=\"\", \"\", IF(IFERROR(VLOOKUP(D55, Dues!D:D, 1, FALSE), \"\")=\"\", \"No\", \"Yes\"))","v":"Yes"},{"$f":"IF(D55=\"\", \"\", IF(IFERROR(VLOOKUP(D55, Interview!D:D, 1, FALSE), \"\")<>\"\", \"Yes\", IF(OR(C55=\"Fr\", C55=\"So\", AND(C55=\"Sr\", TODAY()<43646)), \"N/A\", \"No\")))","v":"Yes"}]
["Yang","Gao","Jr","yug61",{"$f":"COUNTIF(Event1!$D:$D, D56) + COUNTIF(Event2!$D:$D, D56) + COUNTIF(Event3!$D:$D, D56) + COUNTIF(Event4!$D:$D, D56) + COUNTIF(Event5!$D:$D, D56) + COUNTIF(Event6!$D:$D, D56) + COUNTIF(Event7!$D:$D, D56) + COUNTIF(Event8!$D:$D, D56) + COUNTIF(Event9!$D:$D, D56) + COUNTIF(Event10!$D:$D, D56) + COUNTIF(Event11!$D:$D, D56) + COUNTIF(Event12!$D:$D, D56) + COUNTIF(Event13!$D:$D, D56) + COUNTIF(Event14!$D:$D, D56) + COUNTIF(Event15!$D:$D, D56) + COUNTIF(Event16!$D:$D, D56) + COUNTIF(Event17!$D:$D, D56) + COUNTIF(Event18!$D:$D, D56) + COUNTIF(Event19!$D:$D, D56) + COUNTIF(Event20!$D:$D, D56) + COUNTIF(Event21!$D:$D, D56) + COUNTIF(Event22!$D:$D, D56) + COUNTIF(Event23!$D:$D, D56) + COUNTIF(Event24!$D:$D, D56) + COUNTIF(Event25!$D:$D, D56) + 0","v":6},{"$f":"IF(D56=\"\", \"\", IF(IFERROR(VLOOKUP(D56, Dues!D:D, 1, FALSE), \"\")=\"\", \"No\", \"Yes\"))","v":"Yes"},{"$f":"IF(D56=\"\", \"\", IF(IFERROR(VLOOKUP(D56, Interview!D:D, 1, FALSE), \"\")<>\"\", \"Yes\", IF(OR(C56=\"Fr\", C56=\"So\", AND(C56=\"Sr\", TODAY()<43646)), \"N/A\", \"No\")))","v":"Yes"}]
["Huiyang","Ding","Sr","hvd5093",{"$f":"COUNTIF(Event1!$D:$D, D57) + COUNTIF(Event2!$D:$D, D57) + COUNTIF(Event3!$D:$D, D57) + COUNTIF(Event4!$D:$D, D57) + COUNTIF(Event5!$D:$D, D57) + COUNTIF(Event6!$D:$D, D57) + COUNTIF(Event7!$D:$D, D57) + COUNTIF(Event8!$D:$D, D57) + COUNTIF(Event9!$D:$D, D57) + COUNTIF(Event10!$D:$D, D57) + COUNTIF(Event11!$D:$D, D57) + COUNTIF(Event12!$D:$D, D57) + COUNTIF(Event13!$D:$D, D57) + COUNTIF(Event14!$D:$D, D57) + COUNTIF(Event15!$D:$D, D57) + COUNTIF(Event16!$D:$D, D57) + COUNTIF(Event17!$D:$D, D57) + COUNTIF(Event18!$D:$D, D57) + COUNTIF(Event19!$D:$D, D57) + COUNTIF(Event20!$D:$D, D57) + COUNTIF(Event21!$D:$D, D57) + COUNTIF(Event22!$D:$D, D57) + COUNTIF(Event23!$D:$D, D57) + COUNTIF(Event24!$D:$D, D57) + COUNTIF(Event25!$D:$D, D57) + 0","v":6},{"$f":"IF(D57=\"\", \"\", IF(IFERROR(VLOOKUP(D57, Dues!D:D, 1, FALSE), \"\")=\"\", \"No\", \"Yes\"))","v":"No"},{"$f":"IF(D57=\"\", \"\", IF(IFERROR(VLOOKUP(D57, Interview!D:D, 1, FALSE), \"\")<>\"\", \"Yes\", IF(OR(C57=\"Fr\", C57=\"So\", AND(C57=\"Sr\", TODAY()<43646)), \"N/A\", \"No\")))","v":"Yes"}]
["Courtney","Cherry","Jr","clc5887",{"$f":"COUNTIF(Event1!$D:$D, D58) + COUNTIF(Event2!$D:$D, D58) + COUNTIF(Event3!$D:$D, D58) + COUNTIF(Event4!$D:$D, D58) + COUNTIF(Event5!$D:$D, D58) + COUNTIF(Event6!$D:$D, D58) + COUNTIF(Event7!$D:$D, D58) + COUNTIF(Event8!$D:$D, D58) + COUNTIF(Event9!$D:$D, D58) + COUNTIF(Event10!$D:$D, D58) + COUNTIF(Event11!$D:$D, D58) + COUNTIF(Event12!$D:$D, D58) + COUNTIF(Event13!$D:$D, D58) + COUNTIF(Event14!$D:$D, D58) + COUNTIF(Event15!$D:$D, D58) + COUNTIF(Event16!$D:$D, D58) + COUNTIF(Event17!$D:$D, D58) + COUNTIF(Event18!$D:$D, D58) + COUNTIF(Event19!$D:$D, D58) + COUNTIF(Event20!$D:$D, D58) + COUNTIF(Event21!$D:$D, D58) + COUNTIF(Event22!$D:$D, D58) + COUNTIF(Event23!$D:$D, D58) + COUNTIF(Event24!$D:$D, D58) + COUNTIF(Event25!$D:$D, D58) + 0","v":6},{"$f":"IF(D58=\"\", \"\", IF(IFERROR(VLOOKUP(D58, Dues!D:D, 1, FALSE), \"\")=\"\", \"No\", \"Yes\"))","v":"Yes"},{"$f":"IF(D58=\"\", \"\", IF(IFERROR(VLOOKUP(D58, Interview!D:D, 1, FALSE), \"\")<>\"\", \"Yes\", IF(OR(C58=\"Fr\", C58=\"So\", AND(C58=\"Sr\", TODAY()<43646)), \"N/A\", \"No\")))","v":"Yes"}]
["Yuxin","Chen","So","ymc5216",{"$f":"COUNTIF(Event1!$D:$D, D59) + COUNTIF(Event2!$D:$D, D59) + COUNTIF(Event3!$D:$D, D59) + COUNTIF(Event4!$D:$D, D59) + COUNTIF(Event5!$D:$D, D59) + COUNTIF(Event6!$D:$D, D59) + COUNTIF(Event7!$D:$D, D59) + COUNTIF(Event8!$D:$D, D59) + COUNTIF(Event9!$D:$D, D59) + COUNTIF(Event10!$D:$D, D59) + COUNTIF(Event11!$D:$D, D59) + COUNTIF(Event12!$D:$D, D59) + COUNTIF(Event13!$D:$D, D59) + COUNTIF(Event14!$D:$D, D59) + COUNTIF(Event15!$D:$D, D59) + COUNTIF(Event16!$D:$D, D59) + COUNTIF(Event17!$D:$D, D59) + COUNTIF(Event18!$D:$D, D59) + COUNTIF(Event19!$D:$D, D59) + COUNTIF(Event20!$D:$D, D59) + COUNTIF(Event21!$D:$D, D59) + COUNTIF(Event22!$D:$D, D59) + COUNTIF(Event23!$D:$D, D59) + COUNTIF(Event24!$D:$D, D59) + COUNTIF(Event25!$D:$D, D59) + 0","v":5},{"$f":"IF(D59=\"\", \"\", IF(IFERROR(VLOOKUP(D59, Dues!D:D, 1, FALSE), \"\")=\"\", \"No\", \"Yes\"))","v":"Yes"},{"$f":"IF(D59=\"\", \"\", IF(IFERROR(VLOOKUP(D59, Interview!D:D, 1, FALSE), \"\")<>\"\", \"Yes\", IF(OR(C59=\"Fr\", C59=\"So\", AND(C59=\"Sr\", TODAY()<43646)), \"N/A\", \"No\")))","v":"N/A"}]
["Morgan","Wetzel","Sr","maw5942",{"$f":"COUNTIF(Event1!$D:$D, D60) + COUNTIF(Event2!$D:$D, D60) + COUNTIF(Event3!$D:$D, D60) + COUNTIF(Event4!$D:$D, D60) + COUNTIF(Event5!$D:$D, D60) + COUNTIF(Event6!$D:$D, D60) + COUNTIF(Event7!$D:$D, D60) + COUNTIF(Event8!$D:$D, D60) + COUNTIF(Event9!$D:$D, D60) + COUNTIF(Event10!$D:$D, D60) + COUNTIF(Event11!$D:$D, D60) + COUNTIF(Event12!$D:$D, D60) + COUNTIF(Event13!$D:$D, D60) + COUNTIF(Event14!$D:$D, D60) + COUNTIF(Event15!$D:$D, D60) + COUNTIF(Event16!$D:$D, D60) + COUNTIF(Event17!$D:$D, D60) + COUNTIF(Event18!$D:$D, D60) + COUNTIF(Event19!$D:$D, D60) + COUNTIF(Event20!$D:$D, D60) + COUNTIF(Event21!$D:$D, D60) + COUNTIF(Event22!$D:$D, D60) + COUNTIF(Event23!$D:$D, D60) + COUNTIF(Event24!$D:$D, D60) + COUNTIF(Event25!$D:$D, D60) + 0","v":5},{"$f":"IF(D60=\"\", \"\", IF(IFERROR(VLOOKUP(D60, Dues!D:D, 1, FALSE), \"\")=\"\", \"No\", \"Yes\"))","v":"Yes"},{"$f":"IF(D60=\"\", \"\", IF(IFERROR(VLOOKUP(D60, Interview!D:D, 1, FALSE), \"\")<>\"\", \"Yes\", IF(OR(C60=\"Fr\", C60=\"So\", AND(C60=\"Sr\", TODAY()<43646)), \"N/A\", \"No\")))","v":"N/A"}]
["Tyler","Dolan","Fr","tmd5648",{"$f":"COUNTIF(Event1!$D:$D, D61) + COUNTIF(Event2!$D:$D, D61) + COUNTIF(Event3!$D:$D, D61) + COUNTIF(Event4!$D:$D, D61) + COUNTIF(Event5!$D:$D, D61) + COUNTIF(Event6!$D:$D, D61) + COUNTIF(Event7!$D:$D, D61) + COUNTIF(Event8!$D:$D, D61) + COUNTIF(Event9!$D:$D, D61) + COUNTIF(Event10!$D:$D, D61) + COUNTIF(Event11!$D:$D, D61) + COUNTIF(Event12!$D:$D, D61) + COUNTIF(Event13!$D:$D, D61) + COUNTIF(Event14!$D:$D, D61) + COUNTIF(Event15!$D:$D, D61) + COUNTIF(Event16!$D:$D, D61) + COUNTIF(Event17!$D:$D, D61) + COUNTIF(Event18!$D:$D, D61) + COUNTIF(Event19!$D:$D, D61) + COUNTIF(Event20!$D:$D, D61) + COUNTIF(Event21!$D:$D, D61) + COUNTIF(Event22!$D:$D, D61) + COUNTIF(Event23!$D:$D, D61) + COUNTIF(Event24!$D:$D, D61) + COUNTIF(Event25!$D:$D, D61) + 0","v":5},{"$f":"IF(D61=\"\", \"\", IF(IFERROR(VLOOKUP(D61, Dues!D:D, 1, FALSE), \"\")=\"\", \"No\", \"Yes\"))","v":"Yes"},{"$f":"IF(D61=\"\", \"\", IF(IFERROR(VLOOKUP(D61, Interview!D:D, 1, FALSE), \"\")<>\"\", \"Yes\", IF(OR(C61=\"Fr\", C61=\"So\", AND(C61=\"Sr\", TODAY()<43646)), \"N/A\", \"No\")))","v":"N/A"}]
["Felishia",null,"So","ffn5018",{"$f":"COUNTIF(Event1!$D:$D, D62) + COUNTIF(Event2!$D:$D, D62) + COUNTIF(Event3!$D:$D, D62) + COUNTIF(Event4!$D:$D, D62) + COUNTIF(Event5!$D:$D, D62) + COUNTIF(Event6!$D:$D, D62) + COUNTIF(Event7!$D:$D, D62) + COUNTIF(Event8!$D:$D, D62) + COUNTIF(Event9!$D:$D, D62) + COUNTIF(Event10!$D:$D, D62) + COUNTIF(Event11!$D:$D, D62) + COUNTIF(Event12!$D:$D, D62) + COUNTIF(Event13!$D:$D, D62) + COUNTIF(Event14!$D:$D, D62) + COUNTIF(Event15!$D:$D, D62) + COUNTIF(Event16!$D:$D, D62) + COUNTIF(Event17!$D:$D, D62) + COUNTIF(Event18!$D:$D, D62) + COUNTIF(Event19!$D:$D, D62) + COUNTIF(Event20!$D:$D, D62) + COUNTIF(Event21!$D:$D, D62) + COUNTIF(Event22!$D:$D, D62) + COUNTIF(Event23!$D:$D, D62) + COUNTIF(Event24!$D:$D, D62) + COUNTIF(Event25!$D:$D, D62) + 0","v":5},{"$f":"IF(D62=\"\", \"\", IF(IFERROR(VLOOKUP(D62, Dues!D:D, 1, FALSE), \"\")=\"\", \"No\", \"Yes\"))","v":"Yes"},{"$f":"IF(D62=\"\", \"\", IF(IFERROR(VLOOKUP(D62, Interview!D:D, 1, FALSE), \"\")<>\"\", \"Yes\", IF(OR(C62=\"Fr\", C62=\"So\", AND(C62=\"Sr\", TODAY()<43646)), \"N/A\", \"No\")))","v":"N/A"}]
["Ilsa","Smith","So","ivs5154",{"$f":"COUNTIF(Event1!$D:$D, D63) + COUNTIF(Event2!$D:$D, D63) + COUNTIF(Event3!$D:$D, D63) + COUNTIF(Event4!$D:$D, D63) + COUNTIF(Event5!$D:$D, D63) + COUNTIF(Event6!$D:$D, D63) + COUNTIF(Event7!$D:$D, D63) + COUNTIF(Event8!$D:$D, D63) + COUNTIF(Event9!$D:$D, D63) + COUNTIF(Event10!$D:$D, D63) + COUNTIF(Event11!$D:$D, D63) + COUNTIF(Event12!$D:$D, D63) + COUNTIF(Event13!$D:$D, D63) + COUNTIF(Event14!$D:$D, D63) + COUNTIF(Event15!$D:$D, D63) + COUNTIF(Event16!$D:$D, D63) + COUNTIF(Event17!$D:$D, D63) + COUNTIF(Event18!$D:$D, D63) + COUNTIF(Event19!$D:$D, D63) + COUNTIF(Event20!$D:$D, D63) + COUNTIF(Event21!$D:$D, D63) + COUNTIF(Event22!$D:$D, D63) + COUNTIF(Event23!$D:$D, D63) + COUNTIF(Event24!$D:$D, D63) + COUNTIF(Event25!$D:$D, D63) + 0","v":5},{"$f":"IF(D63=\"\", \"\", IF(IFERROR(VLOOKUP(D63, Dues!D:D, 1, FALSE), \"\")=\"\", \"No\", \"Yes\"))","v":"Yes"},{"$f":"IF(D63=\"\", \"\", IF(IFERROR(VLOOKUP(D63, Interview!D:D, 1, FALSE), \"\")<>\"\", \"Yes\", IF(OR(C63=\"Fr\", C63=\"So\", AND(C63=\"Sr\", TODAY()<43646)), \"N/A\", \"No\")))","v":"N/A"}]
["Solomon","Szeto","Fr","sms8118",{"$f":"COUNTIF(Event1!$D:$D, D64) + COUNTIF(Event2!$D:$D, D64) + COUNTIF(Event3!$D:$D, D64) + COUNTIF(Event4!$D:$D, D64) + COUNTIF(Event5!$D:$D, D64) + COUNTIF(Event6!$D:$D, D64) + COUNTIF(Event7!$D:$D, D64) + COUNTIF(Event8!$D:$D, D64) + COUNTIF(Event9!$D:$D, D64) + COUNTIF(Event10!$D:$D, D64) + COUNTIF(Event11!$D:$D, D64) + COUNTIF(Event12!$D:$D, D64) + COUNTIF(Event13!$D:$D, D64) + COUNTIF(Event14!$D:$D, D64) + COUNTIF(Event15!$D:$D, D64) + COUNTIF(Event16!$D:$D, D64) + COUNTIF(Event17!$D:$D, D64) + COUNTIF(Event18!$D:$D, D64) + COUNTIF(Event19!$D:$D, D64) + COUNTIF(Event20!$D:$D, D64) + COUNTIF(Event21!$D:$D, D64) + COUNTIF(Event22!$D:$D, D64) + COUNTIF(Event23!$D:$D, D64) + COUNTIF(Event24!$D:$D, D64) + COUNTIF(Event25!$D:$D, D64) + 0","v":5},{"$f":"IF(D64=\"\", \"\", IF(IFERROR(VLOOKUP(D64, Dues!D:D, 1, FALSE), \"\")=\"\", \"No\", \"Yes\"))","v":"No"},{"$f":"IF(D64=\"\", \"\", IF(IFERROR(VLOOKUP(D64, Interview!D:D, 1, FALSE), \"\")<>\"\", \"Yes\", IF(OR(C64=\"Fr\", C64=\"So\", AND(C64=\"Sr\", TODAY()<43646)), \"N/A\", \"No\")))","v":"N/A"}]
["Kevin","Suryanto","Jr","kas7146",{"$f":"COUNTIF(Event1!$D:$D, D65) + COUNTIF(Event2!$D:$D, D65) + COUNTIF(Event3!$D:$D, D65) + COUNTIF(Event4!$D:$D, D65) + COUNTIF(Event5!$D:$D, D65) + COUNTIF(Event6!$D:$D, D65) + COUNTIF(Event7!$D:$D, D65) + COUNTIF(Event8!$D:$D, D65) + COUNTIF(Event9!$D:$D, D65) + COUNTIF(Event10!$D:$D, D65) + COUNTIF(Event11!$D:$D, D65) + COUNTIF(Event12!$D:$D, D65) + COUNTIF(Event13!$D:$D, D65) + COUNTIF(Event14!$D:$D, D65) + COUNTIF(Event15!$D:$D, D65) + COUNTIF(Event16!$D:$D, D65) + COUNTIF(Event17!$D:$D, D65) + COUNTIF(Event18!$D:$D, D65) + COUNTIF(Event19!$D:$D, D65) + COUNTIF(Event20!$D:$D, D65) + COUNTIF(Event21!$D:$D, D65) + COUNTIF(Event22!$D:$D, D65) + COUNTIF(Event23!$D:$D, D65) + COUNTIF(Event24!$D:$D, D65) + COUNTIF(Event25!$D:$D, D65) + 0","v":5},{"$f":"IF(D65=\"\", \"\", IF(IFERROR(VLOOKUP(D65, Dues!D:D, 1, FALSE), \"\")=\"\", \"No\", \"Yes\"))","v":"Yes"},{"$f":"IF(D65=\"\", \"\", IF(IFERROR(VLOOKUP(D65, Interview!D:D, 1, FALSE), \"\")<>\"\", \"Yes\", IF(OR(C65=\"Fr\", C65=\"So\", AND(C65=\"Sr\", TODAY()<43646)), \"N/A\", \"No\")))","v":"Yes"}]
["justin","Strecker","Jr","jxs6288",{"$f":"COUNTIF(Event1!$D:$D, D66) + COUNTIF(Event2!$D:$D, D66) + COUNTIF(Event3!$D:$D, D66) + COUNTIF(Event4!$D:$D, D66) + COUNTIF(Event5!$D:$D, D66) + COUNTIF(Event6!$D:$D, D66) + COUNTIF(Event7!$D:$D, D66) + COUNTIF(Event8!$D:$D, D66) + COUNTIF(Event9!$D:$D, D66) + COUNTIF(Event10!$D:$D, D66) + COUNTIF(Event11!$D:$D, D66) + COUNTIF(Event12!$D:$D, D66) + COUNTIF(Event13!$D:$D, D66) + COUNTIF(Event14!$D:$D, D66) + COUNTIF(Event15!$D:$D, D66) + COUNTIF(Event16!$D:$D, D66) + COUNTIF(Event17!$D:$D, D66) + COUNTIF(Event18!$D:$D, D66) + COUNTIF(Event19!$D:$D, D66) + COUNTIF(Event20!$D:$D, D66) + COUNTIF(Event21!$D:$D, D66) + COUNTIF(Event22!$D:$D, D66) + COUNTIF(Event23!$D:$D, D66) + COUNTIF(Event24!$D:$D, D66) + COUNTIF(Event25!$D:$D, D66) + 0","v":5},{"$f":"IF(D66=\"\", \"\", IF(IFERROR(VLOOKUP(D66, Dues!D:D, 1, FALSE), \"\")=\"\", \"No\", \"Yes\"))","v":"Yes"},{"$f":"IF(D66=\"\", \"\", IF(IFERROR(VLOOKUP(D66, Interview!D:D, 1, FALSE), \"\")<>\"\", \"Yes\", IF(OR(C66=\"Fr\", C66=\"So\", AND(C66=\"Sr\", TODAY()<43646)), \"N/A\", \"No\")))","v":"Yes"}]
["Emily","Price","Sr","emp5391",{"$f":"COUNTIF(Event1!$D:$D, D67) + COUNTIF(Event2!$D:$D, D67) + COUNTIF(Event3!$D:$D, D67) + COUNTIF(Event4!$D:$D, D67) + COUNTIF(Event5!$D:$D, D67) + COUNTIF(Event6!$D:$D, D67) + COUNTIF(Event7!$D:$D, D67) + COUNTIF(Event8!$D:$D, D67) + COUNTIF(Event9!$D:$D, D67) + COUNTIF(Event10!$D:$D, D67) + COUNTIF(Event11!$D:$D, D67) + COUNTIF(Event12!$D:$D, D67) + COUNTIF(Event13!$D:$D, D67) + COUNTIF(Event14!$D:$D, D67) + COUNTIF(Event15!$D:$D, D67) + COUNTIF(Event16!$D:$D, D67) + COUNTIF(Event17!$D:$D, D67) + COUNTIF(Event18!$D:$D, D67) + COUNTIF(Event19!$D:$D, D67) + COUNTIF(Event20!$D:$D, D67) + COUNTIF(Event21!$D:$D, D67) + COUNTIF(Event22!$D:$D, D67) + COUNTIF(Event23!$D:$D, D67) + COUNTIF(Event24!$D:$D, D67) + COUNTIF(Event25!$D:$D, D67) + 0","v":5},{"$f":"IF(D67=\"\", \"\", IF(IFERROR(VLOOKUP(D67, Dues!D:D, 1, FALSE), \"\")=\"\", \"No\", \"Yes\"))","v":"Yes"},{"$f":"IF(D67=\"\", \"\", IF(IFERROR(VLOOKUP(D67, Interview!D:D, 1, FALSE), \"\")<>\"\", \"Yes\", IF(OR(C67=\"Fr\", C67=\"So\", AND(C67=\"Sr\", TODAY()<43646)), \"N/A\", \"No\")))","v":"N/A"}]
["Kurt","Baurle","Sr","kmb6692",{"$f":"COUNTIF(Event1!$D:$D, D68) + COUNTIF(Event2!$D:$D, D68) + COUNTIF(Event3!$D:$D, D68) + COUNTIF(Event4!$D:$D, D68) + COUNTIF(Event5!$D:$D, D68) + COUNTIF(Event6!$D:$D, D68) + COUNTIF(Event7!$D:$D, D68) + COUNTIF(Event8!$D:$D, D68) + COUNTIF(Event9!$D:$D, D68) + COUNTIF(Event10!$D:$D, D68) + COUNTIF(Event11!$D:$D, D68) + COUNTIF(Event12!$D:$D, D68) + COUNTIF(Event13!$D:$D, D68) + COUNTIF(Event14!$D:$D, D68) + COUNTIF(Event15!$D:$D, D68) + COUNTIF(Event16!$D:$D, D68) + COUNTIF(Event17!$D:$D, D68) + COUNTIF(Event18!$D:$D, D68) + COUNTIF(Event19!$D:$D, D68) + COUNTIF(Event20!$D:$D, D68) + COUNTIF(Event21!$D:$D, D68) + COUNTIF(Event22!$D:$D, D68) + COUNTIF(Event23!$D:$D, D68) + COUNTIF(Event24!$D:$D, D68) + COUNTIF(Event25!$D:$D, D68) + 0","v":5},{"$f":"IF(D68=\"\", \"\", IF(IFERROR(VLOOKUP(D68, Dues!D:D, 1, FALSE), \"\")=\"\", \"No\", \"Yes\"))","v":"Yes"},{"$f":"IF(D68=\"\", \"\", IF(IFERROR(VLOOKUP(D68, Interview!D:D, 1, FALSE), \"\")<>\"\", \"Yes\", IF(OR(C68=\"Fr\", C68=\"So\", AND(C68=\"Sr\", TODAY()<43646)), \"N/A\", \"No\")))","v":"N/A"}]
["Iris ","Chow","So","tfc5229",{"$f":"COUNTIF(Event1!$D:$D, D69) + COUNTIF(Event2!$D:$D, D69) + COUNTIF(Event3!$D:$D, D69) + COUNTIF(Event4!$D:$D, D69) + COUNTIF(Event5!$D:$D, D69) + COUNTIF(Event6!$D:$D, D69) + COUNTIF(Event7!$D:$D, D69) + COUNTIF(Event8!$D:$D, D69) + COUNTIF(Event9!$D:$D, D69) + COUNTIF(Event10!$D:$D, D69) + COUNTIF(Event11!$D:$D, D69) + COUNTIF(Event12!$D:$D, D69) + COUNTIF(Event13!$D:$D, D69) + COUNTIF(Event14!$D:$D, D69) + COUNTIF(Event15!$D:$D, D69) + COUNTIF(Event16!$D:$D, D69) + COUNTIF(Event17!$D:$D, D69) + COUNTIF(Event18!$D:$D, D69) + COUNTIF(Event19!$D:$D, D69) + COUNTIF(Event20!$D:$D, D69) + COUNTIF(Event21!$D:$D, D69) + COUNTIF(Event22!$D:$D, D69) + COUNTIF(Event23!$D:$D, D69) + COUNTIF(Event24!$D:$D, D69) + COUNTIF(Event25!$D:$D, D69) + 0","v":5},{"$f":"IF(D69=\"\", \"\", IF(IFERROR(VLOOKUP(D69, Dues!D:D, 1, FALSE), \"\")=\"\", \"No\", \"Yes\"))","v":"No"},{"$f":"IF(D69=\"\", \"\", IF(IFERROR(VLOOKUP(D69, Interview!D:D, 1, FALSE), \"\")<>\"\", \"Yes\", IF(OR(C69=\"Fr\", C69=\"So\", AND(C69=\"Sr\", TODAY()<43646)), \"N/A\", \"No\")))","v":"N/A"}]
["Joshua","Goldstein","Sr","jjg5636",{"$f":"COUNTIF(Event1!$D:$D, D70) + COUNTIF(Event2!$D:$D, D70) + COUNTIF(Event3!$D:$D, D70) + COUNTIF(Event4!$D:$D, D70) + COUNTIF(Event5!$D:$D, D70) + COUNTIF(Event6!$D:$D, D70) + COUNTIF(Event7!$D:$D, D70) + COUNTIF(Event8!$D:$D, D70) + COUNTIF(Event9!$D:$D, D70) + COUNTIF(Event10!$D:$D, D70) + COUNTIF(Event11!$D:$D, D70) + COUNTIF(Event12!$D:$D, D70) + COUNTIF(Event13!$D:$D, D70) + COUNTIF(Event14!$D:$D, D70) + COUNTIF(Event15!$D:$D, D70) + COUNTIF(Event16!$D:$D, D70) + COUNTIF(Event17!$D:$D, D70) + COUNTIF(Event18!$D:$D, D70) + COUNTIF(Event19!$D:$D, D70) + COUNTIF(Event20!$D:$D, D70) + COUNTIF(Event21!$D:$D, D70) + COUNTIF(Event22!$D:$D, D70) + COUNTIF(Event23!$D:$D, D70) + COUNTIF(Event24!$D:$D, D70) + COUNTIF(Event25!$D:$D, D70) + 0","v":5},{"$f":"IF(D70=\"\", \"\", IF(IFERROR(VLOOKUP(D70, Dues!D:D, 1, FALSE), \"\")=\"\", \"No\", \"Yes\"))","v":"Yes"},{"$f":"IF(D70=\"\", \"\", IF(IFERROR(VLOOKUP(D70, Interview!D:D, 1, FALSE), \"\")<>\"\", \"Yes\", IF(OR(C70=\"Fr\", C70=\"So\", AND(C70=\"Sr\", TODAY()<43646)), \"N/A\", \"No\")))","v":"N/A"}]
["Grace","McStravock","Jr","gvm5232",{"$f":"COUNTIF(Event1!$D:$D, D71) + COUNTIF(Event2!$D:$D, D71) + COUNTIF(Event3!$D:$D, D71) + COUNTIF(Event4!$D:$D, D71) + COUNTIF(Event5!$D:$D, D71) + COUNTIF(Event6!$D:$D, D71) + COUNTIF(Event7!$D:$D, D71) + COUNTIF(Event8!$D:$D, D71) + COUNTIF(Event9!$D:$D, D71) + COUNTIF(Event10!$D:$D, D71) + COUNTIF(Event11!$D:$D, D71) + COUNTIF(Event12!$D:$D, D71) + COUNTIF(Event13!$D:$D, D71) + COUNTIF(Event14!$D:$D, D71) + COUNTIF(Event15!$D:$D, D71) + COUNTIF(Event16!$D:$D, D71) + COUNTIF(Event17!$D:$D, D71) + COUNTIF(Event18!$D:$D, D71) + COUNTIF(Event19!$D:$D, D71) + COUNTIF(Event20!$D:$D, D71) + COUNTIF(Event21!$D:$D, D71) + COUNTIF(Event22!$D:$D, D71) + COUNTIF(Event23!$D:$D, D71) + COUNTIF(Event24!$D:$D, D71) + COUNTIF(Event25!$D:$D, D71) + 0","v":5},{"$f":"IF(D71=\"\", \"\", IF(IFERROR(VLOOKUP(D71, Dues!D:D, 1, FALSE), \"\")=\"\", \"No\", \"Yes\"))","v":"Yes"},{"$f":"IF(D71=\"\", \"\", IF(IFERROR(VLOOKUP(D71, Interview!D:D, 1, FALSE), \"\")<>\"\", \"Yes\", IF(OR(C71=\"Fr\", C71=\"So\", AND(C71=\"Sr\", TODAY()<43646)), \"N/A\", \"No\")))","v":"Yes"}]
["Qin","Zhang","Jr","qfz5029",{"$f":"COUNTIF(Event1!$D:$D, D72) + COUNTIF(Event2!$D:$D, D72) + COUNTIF(Event3!$D:$D, D72) + COUNTIF(Event4!$D:$D, D72) + COUNTIF(Event5!$D:$D, D72) + COUNTIF(Event6!$D:$D, D72) + COUNTIF(Event7!$D:$D, D72) + COUNTIF(Event8!$D:$D, D72) + COUNTIF(Event9!$D:$D, D72) + COUNTIF(Event10!$D:$D, D72) + COUNTIF(Event11!$D:$D, D72) + COUNTIF(Event12!$D:$D, D72) + COUNTIF(Event13!$D:$D, D72) + COUNTIF(Event14!$D:$D, D72) + COUNTIF(Event15!$D:$D, D72) + COUNTIF(Event16!$D:$D, D72) + COUNTIF(Event17!$D:$D, D72) + COUNTIF(Event18!$D:$D, D72) + COUNTIF(Event19!$D:$D, D72) + COUNTIF(Event20!$D:$D, D72) + COUNTIF(Event21!$D:$D, D72) + COUNTIF(Event22!$D:$D, D72) + COUNTIF(Event23!$D:$D, D72) + COUNTIF(Event24!$D:$D, D72) + COUNTIF(Event25!$D:$D, D72) + 0","v":5},{"$f":"IF(D72=\"\", \"\", IF(IFERROR(VLOOKUP(D72, Dues!D:D, 1, FALSE), \"\")=\"\", \"No\", \"Yes\"))","v":"No"},{"$f":"IF(D72=\"\", \"\", IF(IFERROR(VLOOKUP(D72, Interview!D:D, 1, FALSE), \"\")<>\"\", \"Yes\", IF(OR(C72=\"Fr\", C72=\"So\", AND(C72=\"Sr\", TODAY()<43646)), \"N/A\", \"No\")))","v":"Yes"}]
["Zachary","Pasquinelli","Jr","zmp5056",{"$f":"COUNTIF(Event1!$D:$D, D73) + COUNTIF(Event2!$D:$D, D73) + COUNTIF(Event3!$D:$D, D73) + COUNTIF(Event4!$D:$D, D73) + COUNTIF(Event5!$D:$D, D73) + COUNTIF(Event6!$D:$D, D73) + COUNTIF(Event7!$D:$D, D73) + COUNTIF(Event8!$D:$D, D73) + COUNTIF(Event9!$D:$D, D73) + COUNTIF(Event10!$D:$D, D73) + COUNTIF(Event11!$D:$D, D73) + COUNTIF(Event12!$D:$D, D73) + COUNTIF(Event13!$D:$D, D73) + COUNTIF(Event14!$D:$D, D73) + COUNTIF(Event15!$D:$D, D73) + COUNTIF(Event16!$D:$D, D73) + COUNTIF(Event17!$D:$D, D73) + COUNTIF(Event18!$D:$D, D73) + COUNTIF(Event19!$D:$D, D73) + COUNTIF(Event20!$D:$D, D73) + COUNTIF(Event21!$D:$D, D73) + COUNTIF(Event22!$D:$D, D73) + COUNTIF(Event23!$D:$D, D73) + COUNTIF(Event24!$D:$D, D73) + COUNTIF(Event25!$D:$D, D73) + 0","v":5},{"$f":"IF(D73=\"\", \"\", IF(IFERROR(VLOOKUP(D73, Dues!D:D, 1, FALSE), \"\")=\"\", \"No\", \"Yes\"))","v":"No"},{"$f":"IF(D73=\"\", \"\", IF(IFERROR(VLOOKUP(D73, Interview!D:D, 1, FALSE), \"\")<>\"\", \"Yes\", IF(OR(C73=\"Fr\", C73=\"So\", AND(C73=\"Sr\", TODAY()<43646)), \"N/A\", \"No\")))","v":"No"}]
["Amanda","Shuter","Sr","axs6075",{"$f":"COUNTIF(Event1!$D:$D, D74) + COUNTIF(Event2!$D:$D, D74) + COUNTIF(Event3!$D:$D, D74) + COUNTIF(Event4!$D:$D, D74) + COUNTIF(Event5!$D:$D, D74) + COUNTIF(Event6!$D:$D, D74) + COUNTIF(Event7!$D:$D, D74) + COUNTIF(Event8!$D:$D, D74) + COUNTIF(Event9!$D:$D, D74) + COUNTIF(Event10!$D:$D, D74) + COUNTIF(Event11!$D:$D, D74) + COUNTIF(Event12!$D:$D, D74) + COUNTIF(Event13!$D:$D, D74) + COUNTIF(Event14!$D:$D, D74) + COUNTIF(Event15!$D:$D, D74) + COUNTIF(Event16!$D:$D, D74) + COUNTIF(Event17!$D:$D, D74) + COUNTIF(Event18!$D:$D, D74) + COUNTIF(Event19!$D:$D, D74) + COUNTIF(Event20!$D:$D, D74) + COUNTIF(Event21!$D:$D, D74) + COUNTIF(Event22!$D:$D, D74) + COUNTIF(Event23!$D:$D, D74) + COUNTIF(Event24!$D:$D, D74) + COUNTIF(Event25!$D:$D, D74) + 0","v":5},{"$f":"IF(D74=\"\", \"\", IF(IFERROR(VLOOKUP(D74, Dues!D:D, 1, FALSE), \"\")=\"\", \"No\", \"Yes\"))","v":"Yes"},{"$f":"IF(D74=\"\", \"\", IF(IFERROR(VLOOKUP(D74, Interview!D:D, 1, FALSE), \"\")<>\"\", \"Yes\", IF(OR(C74=\"Fr\", C74=\"So\", AND(C74=\"Sr\", TODAY()<43646)), \"N/A\", \"No\")))","v":"Yes"}]
["Ashley","Morris","Sr","alm6239",{"$f":"COUNTIF(Event1!$D:$D, D75) + COUNTIF(Event2!$D:$D, D75) + COUNTIF(Event3!$D:$D, D75) + COUNTIF(Event4!$D:$D, D75) + COUNTIF(Event5!$D:$D, D75) + COUNTIF(Event6!$D:$D, D75) + COUNTIF(Event7!$D:$D, D75) + COUNTIF(Event8!$D:$D, D75) + COUNTIF(Event9!$D:$D, D75) + COUNTIF(Event10!$D:$D, D75) + COUNTIF(Event11!$D:$D, D75) + COUNTIF(Event12!$D:$D, D75) + COUNTIF(Event13!$D:$D, D75) + COUNTIF(Event14!$D:$D, D75) + COUNTIF(Event15!$D:$D, D75) + COUNTIF(Event16!$D:$D, D75) + COUNTIF(Event17!$D:$D, D75) + COUNTIF(Event18!$D:$D, D75) + COUNTIF(Event19!$D:$D, D75) + COUNTIF(Event20!$D:$D, D75) + COUNTIF(Event21!$D:$D, D75) + COUNTIF(Event22!$D:$D, D75) + COUNTIF(Event23!$D:$D, D75) + COUNTIF(Event24!$D:$D, D75) + COUNTIF(Event25!$D:$D, D75) + 0","v":5},{"$f":"IF(D75=\"\", \"\", IF(IFERROR(VLOOKUP(D75, Dues!D:D, 1, FALSE), \"\")=\"\", \"No\", \"Yes\"))","v":"No"},{"$f":"IF(D75=\"\", \"\", IF(IFERROR(VLOOKUP(D75, Interview!D:D, 1, FALSE), \"\")<>\"\", \"Yes\", IF(OR(C75=\"Fr\", C75=\"So\", AND(C75=\"Sr\", TODAY()<43646)), \"N/A\", \"No\")))","v":"N/A"}]
["Alexa","Tannenbaum","Fr","aqt5407",{"$f":"COUNTIF(Event1!$D:$D, D76) + COUNTIF(Event2!$D:$D, D76) + COUNTIF(Event3!$D:$D, D76) + COUNTIF(Event4!$D:$D, D76) + COUNTIF(Event5!$D:$D, D76) + COUNTIF(Event6!$D:$D, D76) + COUNTIF(Event7!$D:$D, D76) + COUNTIF(Event8!$D:$D, D76) + COUNTIF(Event9!$D:$D, D76) + COUNTIF(Event10!$D:$D, D76) + COUNTIF(Event11!$D:$D, D76) + COUNTIF(Event12!$D:$D, D76) + COUNTIF(Event13!$D:$D, D76) + COUNTIF(Event14!$D:$D, D76) + COUNTIF(Event15!$D:$D, D76) + COUNTIF(Event16!$D:$D, D76) + COUNTIF(Event17!$D:$D, D76) + COUNTIF(Event18!$D:$D, D76) + COUNTIF(Event19!$D:$D, D76) + COUNTIF(Event20!$D:$D, D76) + COUNTIF(Event21!$D:$D, D76) + COUNTIF(Event22!$D:$D, D76) + COUNTIF(Event23!$D:$D, D76) + COUNTIF(Event24!$D:$D, D76) + COUNTIF(Event25!$D:$D, D76) + 0","v":4},{"$f":"IF(D76=\"\", \"\", IF(IFERROR(VLOOKUP(D76, Dues!D:D, 1, FALSE), \"\")=\"\", \"No\", \"Yes\"))","v":"Yes"},{"$f":"IF(D76=\"\", \"\", IF(IFERROR(VLOOKUP(D76, Interview!D:D, 1, FALSE), \"\")<>\"\", \"Yes\", IF(OR(C76=\"Fr\", C76=\"So\", AND(C76=\"Sr\", TODAY()<43646)), \"N/A\", \"No\")))","v":"N/A"}]
["Konner","Krueger","Jr","kjk5709",{"$f":"COUNTIF(Event1!$D:$D, D77) + COUNTIF(Event2!$D:$D, D77) + COUNTIF(Event3!$D:$D, D77) + COUNTIF(Event4!$D:$D, D77) + COUNTIF(Event5!$D:$D, D77) + COUNTIF(Event6!$D:$D, D77) + COUNTIF(Event7!$D:$D, D77) + COUNTIF(Event8!$D:$D, D77) + COUNTIF(Event9!$D:$D, D77) + COUNTIF(Event10!$D:$D, D77) + COUNTIF(Event11!$D:$D, D77) + COUNTIF(Event12!$D:$D, D77) + COUNTIF(Event13!$D:$D, D77) + COUNTIF(Event14!$D:$D, D77) + COUNTIF(Event15!$D:$D, D77) + COUNTIF(Event16!$D:$D, D77) + COUNTIF(Event17!$D:$D, D77) + COUNTIF(Event18!$D:$D, D77) + COUNTIF(Event19!$D:$D, D77) + COUNTIF(Event20!$D:$D, D77) + COUNTIF(Event21!$D:$D, D77) + COUNTIF(Event22!$D:$D, D77) + COUNTIF(Event23!$D:$D, D77) + COUNTIF(Event24!$D:$D, D77) + COUNTIF(Event25!$D:$D, D77) + 0","v":4},{"$f":"IF(D77=\"\", \"\", IF(IFERROR(VLOOKUP(D77, Dues!D:D, 1, FALSE), \"\")=\"\", \"No\", \"Yes\"))","v":"Yes"},{"$f":"IF(D77=\"\", \"\", IF(IFERROR(VLOOKUP(D77, Interview!D:D, 1, FALSE), \"\")<>\"\", \"Yes\", IF(OR(C77=\"Fr\", C77=\"So\", AND(C77=\"Sr\", TODAY()<43646)), \"N/A\", \"No\")))","v":"Yes"}]
["Vince","Melchiorre","Fr","vzm35",{"$f":"COUNTIF(Event1!$D:$D, D78) + COUNTIF(Event2!$D:$D, D78) + COUNTIF(Event3!$D:$D, D78) + COUNTIF(Event4!$D:$D, D78) + COUNTIF(Event5!$D:$D, D78) + COUNTIF(Event6!$D:$D, D78) + COUNTIF(Event7!$D:$D, D78) + COUNTIF(Event8!$D:$D, D78) + COUNTIF(Event9!$D:$D, D78) + COUNTIF(Event10!$D:$D, D78) + COUNTIF(Event11!$D:$D, D78) + COUNTIF(Event12!$D:$D, D78) + COUNTIF(Event13!$D:$D, D78) + COUNTIF(Event14!$D:$D, D78) + COUNTIF(Event15!$D:$D, D78) + COUNTIF(Event16!$D:$D, D78) + COUNTIF(Event17!$D:$D, D78) + COUNTIF(Event18!$D:$D, D78) + COUNTIF(Event19!$D:$D, D78) + COUNTIF(Event20!$D:$D, D78) + COUNTIF(Event21!$D:$D, D78) + COUNTIF(Event22!$D:$D, D78) + COUNTIF(Event23!$D:$D, D78) + COUNTIF(Event24!$D:$D, D78) + COUNTIF(Event25!$D:$D, D78) + 0","v":4},{"$f":"IF(D78=\"\", \"\", IF(IFERROR(VLOOKUP(D78, Dues!D:D, 1, FALSE), \"\")=\"\", \"No\", \"Yes\"))","v":"Yes"},{"$f":"IF(D78=\"\", \"\", IF(IFERROR(VLOOKUP(D78, Interview!D:D, 1, FALSE), \"\")<>\"\", \"Yes\", IF(OR(C78=\"Fr\", C78=\"So\", AND(C78=\"Sr\", TODAY()<43646)), \"N/A\", \"No\")))","v":"N/A"}]
["matthew","cash","So","mdc5571",{"$f":"COUNTIF(Event1!$D:$D, D79) + COUNTIF(Event2!$D:$D, D79) + COUNTIF(Event3!$D:$D, D79) + COUNTIF(Event4!$D:$D, D79) + COUNTIF(Event5!$D:$D, D79) + COUNTIF(Event6!$D:$D, D79) + COUNTIF(Event7!$D:$D, D79) + COUNTIF(Event8!$D:$D, D79) + COUNTIF(Event9!$D:$D, D79) + COUNTIF(Event10!$D:$D, D79) + COUNTIF(Event11!$D:$D, D79) + COUNTIF(Event12!$D:$D, D79) + COUNTIF(Event13!$D:$D, D79) + COUNTIF(Event14!$D:$D, D79) + COUNTIF(Event15!$D:$D, D79) + COUNTIF(Event16!$D:$D, D79) + COUNTIF(Event17!$D:$D, D79) + COUNTIF(Event18!$D:$D, D79) + COUNTIF(Event19!$D:$D, D79) + COUNTIF(Event20!$D:$D, D79) + COUNTIF(Event21!$D:$D, D79) + COUNTIF(Event22!$D:$D, D79) + COUNTIF(Event23!$D:$D, D79) + COUNTIF(Event24!$D:$D, D79) + COUNTIF(Event25!$D:$D, D79) + 0","v":4},{"$f":"IF(D79=\"\", \"\", IF(IFERROR(VLOOKUP(D79, Dues!D:D, 1, FALSE), \"\")=\"\", \"No\", \"Yes\"))","v":"Yes"},{"$f":"IF(D79=\"\", \"\", IF(IFERROR(VLOOKUP(D79, Interview!D:D, 1, FALSE), \"\")<>\"\", \"Yes\", IF(OR(C79=\"Fr\", C79=\"So\", AND(C79=\"Sr\", TODAY()<43646)), \"N/A\", \"No\")))","v":"N/A"}]
["Erica","Mills","So","ekm5337",{"$f":"COUNTIF(Event1!$D:$D, D80) + COUNTIF(Event2!$D:$D, D80) + COUNTIF(Event3!$D:$D, D80) + COUNTIF(Event4!$D:$D, D80) + COUNTIF(Event5!$D:$D, D80) + COUNTIF(Event6!$D:$D, D80) + COUNTIF(Event7!$D:$D, D80) + COUNTIF(Event8!$D:$D, D80) + COUNTIF(Event9!$D:$D, D80) + COUNTIF(Event10!$D:$D, D80) + COUNTIF(Event11!$D:$D, D80) + COUNTIF(Event12!$D:$D, D80) + COUNTIF(Event13!$D:$D, D80) + COUNTIF(Event14!$D:$D, D80) + COUNTIF(Event15!$D:$D, D80) + COUNTIF(Event16!$D:$D, D80) + COUNTIF(Event17!$D:$D, D80) + COUNTIF(Event18!$D:$D, D80) + COUNTIF(Event19!$D:$D, D80) + COUNTIF(Event20!$D:$D, D80) + COUNTIF(Event21!$D:$D, D80) + COUNTIF(Event22!$D:$D, D80) + COUNTIF(Event23!$D:$D, D80) + COUNTIF(Event24!$D:$D, D80) + COUNTIF(Event25!$D:$D, D80) + 0","v":4},{"$f":"IF(D80=\"\", \"\", IF(IFERROR(VLOOKUP(D80, Dues!D:D, 1, FALSE), \"\")=\"\", \"No\", \"Yes\"))","v":"Yes"},{"$f":"IF(D80=\"\", \"\", IF(IFERROR(VLOOKUP(D80, Interview!D:D, 1, FALSE), \"\")<>\"\", \"Yes\", IF(OR(C80=\"Fr\", C80=\"So\", AND(C80=\"Sr\", TODAY()<43646)), \"N/A\", \"No\")))","v":"N/A"}]
["Ryan","Hazel","So","rxh378",{"$f":"COUNTIF(Event1!$D:$D, D81) + COUNTIF(Event2!$D:$D, D81) + COUNTIF(Event3!$D:$D, D81) + COUNTIF(Event4!$D:$D, D81) + COUNTIF(Event5!$D:$D, D81) + COUNTIF(Event6!$D:$D, D81) + COUNTIF(Event7!$D:$D, D81) + COUNTIF(Event8!$D:$D, D81) + COUNTIF(Event9!$D:$D, D81) + COUNTIF(Event10!$D:$D, D81) + COUNTIF(Event11!$D:$D, D81) + COUNTIF(Event12!$D:$D, D81) + COUNTIF(Event13!$D:$D, D81) + COUNTIF(Event14!$D:$D, D81) + COUNTIF(Event15!$D:$D, D81) + COUNTIF(Event16!$D:$D, D81) + COUNTIF(Event17!$D:$D, D81) + COUNTIF(Event18!$D:$D, D81) + COUNTIF(Event19!$D:$D, D81) + COUNTIF(Event20!$D:$D, D81) + COUNTIF(Event21!$D:$D, D81) + COUNTIF(Event22!$D:$D, D81) + COUNTIF(Event23!$D:$D, D81) + COUNTIF(Event24!$D:$D, D81) + COUNTIF(Event25!$D:$D, D81) + 0","v":4},{"$f":"IF(D81=\"\", \"\", IF(IFERROR(VLOOKUP(D81, Dues!D:D, 1, FALSE), \"\")=\"\", \"No\", \"Yes\"))","v":"Yes"},{"$f":"IF(D81=\"\", \"\", IF(IFERROR(VLOOKUP(D81, Interview!D:D, 1, FALSE), \"\")<>\"\", \"Yes\", IF(OR(C81=\"Fr\", C81=\"So\", AND(C81=\"Sr\", TODAY()<43646)), \"N/A\", \"No\")))","v":"N/A"}]
["Peter","DeMallie","So","prd5123",{"$f":"COUNTIF(Event1!$D:$D, D82) + COUNTIF(Event2!$D:$D, D82) + COUNTIF(Event3!$D:$D, D82) + COUNTIF(Event4!$D:$D, D82) + COUNTIF(Event5!$D:$D, D82) + COUNTIF(Event6!$D:$D, D82) + COUNTIF(Event7!$D:$D, D82) + COUNTIF(Event8!$D:$D, D82) + COUNTIF(Event9!$D:$D, D82) + COUNTIF(Event10!$D:$D, D82) + COUNTIF(Event11!$D:$D, D82) + COUNTIF(Event12!$D:$D, D82) + COUNTIF(Event13!$D:$D, D82) + COUNTIF(Event14!$D:$D, D82) + COUNTIF(Event15!$D:$D, D82) + COUNTIF(Event16!$D:$D, D82) + COUNTIF(Event17!$D:$D, D82) + COUNTIF(Event18!$D:$D, D82) + COUNTIF(Event19!$D:$D, D82) + COUNTIF(Event20!$D:$D, D82) + COUNTIF(Event21!$D:$D, D82) + COUNTIF(Event22!$D:$D, D82) + COUNTIF(Event23!$D:$D, D82) + COUNTIF(Event24!$D:$D, D82) + COUNTIF(Event25!$D:$D, D82) + 0","v":4},{"$f":"IF(D82=\"\", \"\", IF(IFERROR(VLOOKUP(D82, Dues!D:D, 1, FALSE), \"\")=\"\", \"No\", \"Yes\"))","v":"Yes"},{"$f":"IF(D82=\"\", \"\", IF(IFERROR(VLOOKUP(D82, Interview!D:D, 1, FALSE), \"\")<>\"\", \"Yes\", IF(OR(C82=\"Fr\", C82=\"So\", AND(C82=\"Sr\", TODAY()<43646)), \"N/A\", \"No\")))","v":"N/A"}]
["Myles","Cramer","Fr","mfc5610",{"$f":"COUNTIF(Event1!$D:$D, D83) + COUNTIF(Event2!$D:$D, D83) + COUNTIF(Event3!$D:$D, D83) + COUNTIF(Event4!$D:$D, D83) + COUNTIF(Event5!$D:$D, D83) + COUNTIF(Event6!$D:$D, D83) + COUNTIF(Event7!$D:$D, D83) + COUNTIF(Event8!$D:$D, D83) + COUNTIF(Event9!$D:$D, D83) + COUNTIF(Event10!$D:$D, D83) + COUNTIF(Event11!$D:$D, D83) + COUNTIF(Event12!$D:$D, D83) + COUNTIF(Event13!$D:$D, D83) + COUNTIF(Event14!$D:$D, D83) + COUNTIF(Event15!$D:$D, D83) + COUNTIF(Event16!$D:$D, D83) + COUNTIF(Event17!$D:$D, D83) + COUNTIF(Event18!$D:$D, D83) + COUNTIF(Event19!$D:$D, D83) + COUNTIF(Event20!$D:$D, D83) + COUNTIF(Event21!$D:$D, D83) + COUNTIF(Event22!$D:$D, D83) + COUNTIF(Event23!$D:$D, D83) + COUNTIF(Event24!$D:$D, D83) + COUNTIF(Event25!$D:$D, D83) + 0","v":4},{"$f":"IF(D83=\"\", \"\", IF(IFERROR(VLOOKUP(D83, Dues!D:D, 1, FALSE), \"\")=\"\", \"No\", \"Yes\"))","v":"No"},{"$f":"IF(D83=\"\", \"\", IF(IFERROR(VLOOKUP(D83, Interview!D:D, 1, FALSE), \"\")<>\"\", \"Yes\", IF(OR(C83=\"Fr\", C83=\"So\", AND(C83=\"Sr\", TODAY()<43646)), \"N/A\", \"No\")))","v":"N/A"}]
["Yanan","Sun","Jr","yzs70",{"$f":"COUNTIF(Event1!$D:$D, D84) + COUNTIF(Event2!$D:$D, D84) + COUNTIF(Event3!$D:$D, D84) + COUNTIF(Event4!$D:$D, D84) + COUNTIF(Event5!$D:$D, D84) + COUNTIF(Event6!$D:$D, D84) + COUNTIF(Event7!$D:$D, D84) + COUNTIF(Event8!$D:$D, D84) + COUNTIF(Event9!$D:$D, D84) + COUNTIF(Event10!$D:$D, D84) + COUNTIF(Event11!$D:$D, D84) + COUNTIF(Event12!$D:$D, D84) + COUNTIF(Event13!$D:$D, D84) + COUNTIF(Event14!$D:$D, D84) + COUNTIF(Event15!$D:$D, D84) + COUNTIF(Event16!$D:$D, D84) + COUNTIF(Event17!$D:$D, D84) + COUNTIF(Event18!$D:$D, D84) + COUNTIF(Event19!$D:$D, D84) + COUNTIF(Event20!$D:$D, D84) + COUNTIF(Event21!$D:$D, D84) + COUNTIF(Event22!$D:$D, D84) + COUNTIF(Event23!$D:$D, D84) + COUNTIF(Event24!$D:$D, D84) + COUNTIF(Event25!$D:$D, D84) + 0","v":4},{"$f":"IF(D84=\"\", \"\", IF(IFERROR(VLOOKUP(D84, Dues!D:D, 1, FALSE), \"\")=\"\", \"No\", \"Yes\"))","v":"Yes"},{"$f":"IF(D84=\"\", \"\", IF(IFERROR(VLOOKUP(D84, Interview!D:D, 1, FALSE), \"\")<>\"\", \"Yes\", IF(OR(C84=\"Fr\", C84=\"So\", AND(C84=\"Sr\", TODAY()<43646)), \"N/A\", \"No\")))","v":"Yes"}]
["Sunrunyi","Yuan","So ","spy5117",{"$f":"COUNTIF(Event1!$D:$D, D85) + COUNTIF(Event2!$D:$D, D85) + COUNTIF(Event3!$D:$D, D85) + COUNTIF(Event4!$D:$D, D85) + COUNTIF(Event5!$D:$D, D85) + COUNTIF(Event6!$D:$D, D85) + COUNTIF(Event7!$D:$D, D85) + COUNTIF(Event8!$D:$D, D85) + COUNTIF(Event9!$D:$D, D85) + COUNTIF(Event10!$D:$D, D85) + COUNTIF(Event11!$D:$D, D85) + COUNTIF(Event12!$D:$D, D85) + COUNTIF(Event13!$D:$D, D85) + COUNTIF(Event14!$D:$D, D85) + COUNTIF(Event15!$D:$D, D85) + COUNTIF(Event16!$D:$D, D85) + COUNTIF(Event17!$D:$D, D85) + COUNTIF(Event18!$D:$D, D85) + COUNTIF(Event19!$D:$D, D85) + COUNTIF(Event20!$D:$D, D85) + COUNTIF(Event21!$D:$D, D85) + COUNTIF(Event22!$D:$D, D85) + COUNTIF(Event23!$D:$D, D85) + COUNTIF(Event24!$D:$D, D85) + COUNTIF(Event25!$D:$D, D85) + 0","v":4},{"$f":"IF(D85=\"\", \"\", IF(IFERROR(VLOOKUP(D85, Dues!D:D, 1, FALSE), \"\")=\"\", \"No\", \"Yes\"))","v":"Yes"},{"$f":"IF(D85=\"\", \"\", IF(IFERROR(VLOOKUP(D85, Interview!D:D, 1, FALSE), \"\")<>\"\", \"Yes\", IF(OR(C85=\"Fr\", C85=\"So\", AND(C85=\"Sr\", TODAY()<43646)), \"N/A\", \"No\")))","v":"No"}]
["Lucas","Richardsen","Fr","ljr5433",{"$f":"COUNTIF(Event1!$D:$D, D86) + COUNTIF(Event2!$D:$D, D86) + COUNTIF(Event3!$D:$D, D86) + COUNTIF(Event4!$D:$D, D86) + COUNTIF(Event5!$D:$D, D86) + COUNTIF(Event6!$D:$D, D86) + COUNTIF(Event7!$D:$D, D86) + COUNTIF(Event8!$D:$D, D86) + COUNTIF(Event9!$D:$D, D86) + COUNTIF(Event10!$D:$D, D86) + COUNTIF(Event11!$D:$D, D86) + COUNTIF(Event12!$D:$D, D86) + COUNTIF(Event13!$D:$D, D86) + COUNTIF(Event14!$D:$D, D86) + COUNTIF(Event15!$D:$D, D86) + COUNTIF(Event16!$D:$D, D86) + COUNTIF(Event17!$D:$D, D86) + COUNTIF(Event18!$D:$D, D86) + COUNTIF(Event19!$D:$D, D86) + COUNTIF(Event20!$D:$D, D86) + COUNTIF(Event21!$D:$D, D86) + COUNTIF(Event22!$D:$D, D86) + COUNTIF(Event23!$D:$D, D86) + COUNTIF(Event24!$D:$D, D86) + COUNTIF(Event25!$D:$D, D86) + 0","v":4},{"$f":"IF(D86=\"\", \"\", IF(IFERROR(VLOOKUP(D86, Dues!D:D, 1, FALSE), \"\")=\"\", \"No\", \"Yes\"))","v":"Yes"},{"$f":"IF(D86=\"\", \"\", IF(IFERROR(VLOOKUP(D86, Interview!D:D, 1, FALSE), \"\")<>\"\", \"Yes\", IF(OR(C86=\"Fr\", C86=\"So\", AND(C86=\"Sr\", TODAY()<43646)), \"N/A\", \"No\")))","v":"N/A"}]
["Alexis","Coleman","So","akc5641",{"$f":"COUNTIF(Event1!$D:$D, D87) + COUNTIF(Event2!$D:$D, D87) + COUNTIF(Event3!$D:$D, D87) + COUNTIF(Event4!$D:$D, D87) + COUNTIF(Event5!$D:$D, D87) + COUNTIF(Event6!$D:$D, D87) + COUNTIF(Event7!$D:$D, D87) + COUNTIF(Event8!$D:$D, D87) + COUNTIF(Event9!$D:$D, D87) + COUNTIF(Event10!$D:$D, D87) + COUNTIF(Event11!$D:$D, D87) + COUNTIF(Event12!$D:$D, D87) + COUNTIF(Event13!$D:$D, D87) + COUNTIF(Event14!$D:$D, D87) + COUNTIF(Event15!$D:$D, D87) + COUNTIF(Event16!$D:$D, D87) + COUNTIF(Event17!$D:$D, D87) + COUNTIF(Event18!$D:$D, D87) + COUNTIF(Event19!$D:$D, D87) + COUNTIF(Event20!$D:$D, D87) + COUNTIF(Event21!$D:$D, D87) + COUNTIF(Event22!$D:$D, D87) + COUNTIF(Event23!$D:$D, D87) + COUNTIF(Event24!$D:$D, D87) + COUNTIF(Event25!$D:$D, D87) + 0","v":4},{"$f":"IF(D87=\"\", \"\", IF(IFERROR(VLOOKUP(D87, Dues!D:D, 1, FALSE), \"\")=\"\", \"No\", \"Yes\"))","v":"Yes"},{"$f":"IF(D87=\"\", \"\", IF(IFERROR(VLOOKUP(D87, Interview!D:D, 1, FALSE), \"\")<>\"\", \"Yes\", IF(OR(C87=\"Fr\", C87=\"So\", AND(C87=\"Sr\", TODAY()<43646)), \"N/A\", \"No\")))","v":"N/A"}]
["Kyle","Mauger","So","kjm6235",{"$f":"COUNTIF(Event1!$D:$D, D88) + COUNTIF(Event2!$D:$D, D88) + COUNTIF(Event3!$D:$D, D88) + COUNTIF(Event4!$D:$D, D88) + COUNTIF(Event5!$D:$D, D88) + COUNTIF(Event6!$D:$D, D88) + COUNTIF(Event7!$D:$D, D88) + COUNTIF(Event8!$D:$D, D88) + COUNTIF(Event9!$D:$D, D88) + COUNTIF(Event10!$D:$D, D88) + COUNTIF(Event11!$D:$D, D88) + COUNTIF(Event12!$D:$D, D88) + COUNTIF(Event13!$D:$D, D88) + COUNTIF(Event14!$D:$D, D88) + COUNTIF(Event15!$D:$D, D88) + COUNTIF(Event16!$D:$D, D88) + COUNTIF(Event17!$D:$D, D88) + COUNTIF(Event18!$D:$D, D88) + COUNTIF(Event19!$D:$D, D88) + COUNTIF(Event20!$D:$D, D88) + COUNTIF(Event21!$D:$D, D88) + COUNTIF(Event22!$D:$D, D88) + COUNTIF(Event23!$D:$D, D88) + COUNTIF(Event24!$D:$D, D88) + COUNTIF(Event25!$D:$D, D88) + 0","v":4},{"$f":"IF(D88=\"\", \"\", IF(IFERROR(VLOOKUP(D88, Dues!D:D, 1, FALSE), \"\")=\"\", \"No\", \"Yes\"))","v":"Yes"},{"$f":"IF(D88=\"\", \"\", IF(IFERROR(VLOOKUP(D88, Interview!D:D, 1, FALSE), \"\")<>\"\", \"Yes\", IF(OR(C88=\"Fr\", C88=\"So\", AND(C88=\"Sr\", TODAY()<43646)), \"N/A\", \"No\")))","v":"N/A"}]
["Raymond","Lu","So","lmr5640",{"$f":"COUNTIF(Event1!$D:$D, D89) + COUNTIF(Event2!$D:$D, D89) + COUNTIF(Event3!$D:$D, D89) + COUNTIF(Event4!$D:$D, D89) + COUNTIF(Event5!$D:$D, D89) + COUNTIF(Event6!$D:$D, D89) + COUNTIF(Event7!$D:$D, D89) + COUNTIF(Event8!$D:$D, D89) + COUNTIF(Event9!$D:$D, D89) + COUNTIF(Event10!$D:$D, D89) + COUNTIF(Event11!$D:$D, D89) + COUNTIF(Event12!$D:$D, D89) + COUNTIF(Event13!$D:$D, D89) + COUNTIF(Event14!$D:$D, D89) + COUNTIF(Event15!$D:$D, D89) + COUNTIF(Event16!$D:$D, D89) + COUNTIF(Event17!$D:$D, D89) + COUNTIF(Event18!$D:$D, D89) + COUNTIF(Event19!$D:$D, D89) + COUNTIF(Event20!$D:$D, D89) + COUNTIF(Event21!$D:$D, D89) + COUNTIF(Event22!$D:$D, D89) + COUNTIF(Event23!$D:$D, D89) + COUNTIF(Event24!$D:$D, D89) + COUNTIF(Event25!$D:$D, D89) + 0","v":4},{"$f":"IF(D89=\"\", \"\", IF(IFERROR(VLOOKUP(D89, Dues!D:D, 1, FALSE), \"\")=\"\", \"No\", \"Yes\"))","v":"Yes"},{"$f":"IF(D89=\"\", \"\", IF(IFERROR(VLOOKUP(D89, Interview!D:D, 1, FALSE), \"\")<>\"\", \"Yes\", IF(OR(C89=\"Fr\", C89=\"So\", AND(C89=\"Sr\", TODAY()<43646)), \"N/A\", \"No\")))","v":"N/A"}]
["YIDING","WANG","Jr","yzw164",{"$f":"COUNTIF(Event1!$D:$D, D90) + COUNTIF(Event2!$D:$D, D90) + COUNTIF(Event3!$D:$D, D90) + COUNTIF(Event4!$D:$D, D90) + COUNTIF(Event5!$D:$D, D90) + COUNTIF(Event6!$D:$D, D90) + COUNTIF(Event7!$D:$D, D90) + COUNTIF(Event8!$D:$D, D90) + COUNTIF(Event9!$D:$D, D90) + COUNTIF(Event10!$D:$D, D90) + COUNTIF(Event11!$D:$D, D90) + COUNTIF(Event12!$D:$D, D90) + COUNTIF(Event13!$D:$D, D90) + COUNTIF(Event14!$D:$D, D90) + COUNTIF(Event15!$D:$D, D90) + COUNTIF(Event16!$D:$D, D90) + COUNTIF(Event17!$D:$D, D90) + COUNTIF(Event18!$D:$D, D90) + COUNTIF(Event19!$D:$D, D90) + COUNTIF(Event20!$D:$D, D90) + COUNTIF(Event21!$D:$D, D90) + COUNTIF(Event22!$D:$D, D90) + COUNTIF(Event23!$D:$D, D90) + COUNTIF(Event24!$D:$D, D90) + COUNTIF(Event25!$D:$D, D90) + 0","v":4},{"$f":"IF(D90=\"\", \"\", IF(IFERROR(VLOOKUP(D90, Dues!D:D, 1, FALSE), \"\")=\"\", \"No\", \"Yes\"))","v":"No"},{"$f":"IF(D90=\"\", \"\", IF(IFERROR(VLOOKUP(D90, Interview!D:D, 1, FALSE), \"\")<>\"\", \"Yes\", IF(OR(C90=\"Fr\", C90=\"So\", AND(C90=\"Sr\", TODAY()<43646)), \"N/A\", \"No\")))","v":"Yes"}]
["Anu","Ogunrombi","Sr","aso5104",{"$f":"COUNTIF(Event1!$D:$D, D91) + COUNTIF(Event2!$D:$D, D91) + COUNTIF(Event3!$D:$D, D91) + COUNTIF(Event4!$D:$D, D91) + COUNTIF(Event5!$D:$D, D91) + COUNTIF(Event6!$D:$D, D91) + COUNTIF(Event7!$D:$D, D91) + COUNTIF(Event8!$D:$D, D91) + COUNTIF(Event9!$D:$D, D91) + COUNTIF(Event10!$D:$D, D91) + COUNTIF(Event11!$D:$D, D91) + COUNTIF(Event12!$D:$D, D91) + COUNTIF(Event13!$D:$D, D91) + COUNTIF(Event14!$D:$D, D91) + COUNTIF(Event15!$D:$D, D91) + COUNTIF(Event16!$D:$D, D91) + COUNTIF(Event17!$D:$D, D91) + COUNTIF(Event18!$D:$D, D91) + COUNTIF(Event19!$D:$D, D91) + COUNTIF(Event20!$D:$D, D91) + COUNTIF(Event21!$D:$D, D91) + COUNTIF(Event22!$D:$D, D91) + COUNTIF(Event23!$D:$D, D91) + COUNTIF(Event24!$D:$D, D91) + COUNTIF(Event25!$D:$D, D91) + 0","v":4},{"$f":"IF(D91=\"\", \"\", IF(IFERROR(VLOOKUP(D91, Dues!D:D, 1, FALSE), \"\")=\"\", \"No\", \"Yes\"))","v":"Yes"},{"$f":"IF(D91=\"\", \"\", IF(IFERROR(VLOOKUP(D91, Interview!D:D, 1, FALSE), \"\")<>\"\", \"Yes\", IF(OR(C91=\"Fr\", C91=\"So\", AND(C91=\"Sr\", TODAY()<43646)), \"N/A\", \"No\")))","v":"N/A"}]
["Ethan","Frederick","Sr","esf5093",{"$f":"COUNTIF(Event1!$D:$D, D92) + COUNTIF(Event2!$D:$D, D92) + COUNTIF(Event3!$D:$D, D92) + COUNTIF(Event4!$D:$D, D92) + COUNTIF(Event5!$D:$D, D92) + COUNTIF(Event6!$D:$D, D92) + COUNTIF(Event7!$D:$D, D92) + COUNTIF(Event8!$D:$D, D92) + COUNTIF(Event9!$D:$D, D92) + COUNTIF(Event10!$D:$D, D92) + COUNTIF(Event11!$D:$D, D92) + COUNTIF(Event12!$D:$D, D92) + COUNTIF(Event13!$D:$D, D92) + COUNTIF(Event14!$D:$D, D92) + COUNTIF(Event15!$D:$D, D92) + COUNTIF(Event16!$D:$D, D92) + COUNTIF(Event17!$D:$D, D92) + COUNTIF(Event18!$D:$D, D92) + COUNTIF(Event19!$D:$D, D92) + COUNTIF(Event20!$D:$D, D92) + COUNTIF(Event21!$D:$D, D92) + COUNTIF(Event22!$D:$D, D92) + COUNTIF(Event23!$D:$D, D92) + COUNTIF(Event24!$D:$D, D92) + COUNTIF(Event25!$D:$D, D92) + 0","v":4},{"$f":"IF(D92=\"\", \"\", IF(IFERROR(VLOOKUP(D92, Dues!D:D, 1, FALSE), \"\")=\"\", \"No\", \"Yes\"))","v":"Yes"},{"$f":"IF(D92=\"\", \"\", IF(IFERROR(VLOOKUP(D92, Interview!D:D, 1, FALSE), \"\")<>\"\", \"Yes\", IF(OR(C92=\"Fr\", C92=\"So\", AND(C92=\"Sr\", TODAY()<43646)), \"N/A\", \"No\")))","v":"N/A"}]
["Andrew","Modzelewski","Jr","gam5292",{"$f":"COUNTIF(Event1!$D:$D, D93) + COUNTIF(Event2!$D:$D, D93) + COUNTIF(Event3!$D:$D, D93) + COUNTIF(Event4!$D:$D, D93) + COUNTIF(Event5!$D:$D, D93) + COUNTIF(Event6!$D:$D, D93) + COUNTIF(Event7!$D:$D, D93) + COUNTIF(Event8!$D:$D, D93) + COUNTIF(Event9!$D:$D, D93) + COUNTIF(Event10!$D:$D, D93) + COUNTIF(Event11!$D:$D, D93) + COUNTIF(Event12!$D:$D, D93) + COUNTIF(Event13!$D:$D, D93) + COUNTIF(Event14!$D:$D, D93) + COUNTIF(Event15!$D:$D, D93) + COUNTIF(Event16!$D:$D, D93) + COUNTIF(Event17!$D:$D, D93) + COUNTIF(Event18!$D:$D, D93) + COUNTIF(Event19!$D:$D, D93) + COUNTIF(Event20!$D:$D, D93) + COUNTIF(Event21!$D:$D, D93) + COUNTIF(Event22!$D:$D, D93) + COUNTIF(Event23!$D:$D, D93) + COUNTIF(Event24!$D:$D, D93) + COUNTIF(Event25!$D:$D, D93) + 0","v":4},{"$f":"IF(D93=\"\", \"\", IF(IFERROR(VLOOKUP(D93, Dues!D:D, 1, FALSE), \"\")=\"\", \"No\", \"Yes\"))","v":"No"},{"$f":"IF(D93=\"\", \"\", IF(IFERROR(VLOOKUP(D93, Interview!D:D, 1, FALSE), \"\")<>\"\", \"Yes\", IF(OR(C93=\"Fr\", C93=\"So\", AND(C93=\"Sr\", TODAY()<43646)), \"N/A\", \"No\")))","v":"No"}]
["Brandon","Crawford","So","bmc5819",{"$f":"COUNTIF(Event1!$D:$D, D94) + COUNTIF(Event2!$D:$D, D94) + COUNTIF(Event3!$D:$D, D94) + COUNTIF(Event4!$D:$D, D94) + COUNTIF(Event5!$D:$D, D94) + COUNTIF(Event6!$D:$D, D94) + COUNTIF(Event7!$D:$D, D94) + COUNTIF(Event8!$D:$D, D94) + COUNTIF(Event9!$D:$D, D94) + COUNTIF(Event10!$D:$D, D94) + COUNTIF(Event11!$D:$D, D94) + COUNTIF(Event12!$D:$D, D94) + COUNTIF(Event13!$D:$D, D94) + COUNTIF(Event14!$D:$D, D94) + COUNTIF(Event15!$D:$D, D94) + COUNTIF(Event16!$D:$D, D94) + COUNTIF(Event17!$D:$D, D94) + COUNTIF(Event18!$D:$D, D94) + COUNTIF(Event19!$D:$D, D94) + COUNTIF(Event20!$D:$D, D94) + COUNTIF(Event21!$D:$D, D94) + COUNTIF(Event22!$D:$D, D94) + COUNTIF(Event23!$D:$D, D94) + COUNTIF(Event24!$D:$D, D94) + COUNTIF(Event25!$D:$D, D94) + 0","v":4},{"$f":"IF(D94=\"\", \"\", IF(IFERROR(VLOOKUP(D94, Dues!D:D, 1, FALSE), \"\")=\"\", \"No\", \"Yes\"))","v":"Yes"},{"$f":"IF(D94=\"\", \"\", IF(IFERROR(VLOOKUP(D94, Interview!D:D, 1, FALSE), \"\")<>\"\", \"Yes\", IF(OR(C94=\"Fr\", C94=\"So\", AND(C94=\"Sr\", TODAY()<43646)), \"N/A\", \"No\")))","v":"N/A"}]
["Zihan","Zhang","Jr","zuz161",{"$f":"COUNTIF(Event1!$D:$D, D95) + COUNTIF(Event2!$D:$D, D95) + COUNTIF(Event3!$D:$D, D95) + COUNTIF(Event4!$D:$D, D95) + COUNTIF(Event5!$D:$D, D95) + COUNTIF(Event6!$D:$D, D95) + COUNTIF(Event7!$D:$D, D95) + COUNTIF(Event8!$D:$D, D95) + COUNTIF(Event9!$D:$D, D95) + COUNTIF(Event10!$D:$D, D95) + COUNTIF(Event11!$D:$D, D95) + COUNTIF(Event12!$D:$D, D95) + COUNTIF(Event13!$D:$D, D95) + COUNTIF(Event14!$D:$D, D95) + COUNTIF(Event15!$D:$D, D95) + COUNTIF(Event16!$D:$D, D95) + COUNTIF(Event17!$D:$D, D95) + COUNTIF(Event18!$D:$D, D95) + COUNTIF(Event19!$D:$D, D95) + COUNTIF(Event20!$D:$D, D95) + COUNTIF(Event21!$D:$D, D95) + COUNTIF(Event22!$D:$D, D95) + COUNTIF(Event23!$D:$D, D95) + COUNTIF(Event24!$D:$D, D95) + COUNTIF(Event25!$D:$D, D95) + 0","v":4},{"$f":"IF(D95=\"\", \"\", IF(IFERROR(VLOOKUP(D95, Dues!D:D, 1, FALSE), \"\")=\"\", \"No\", \"Yes\"))","v":"No"},{"$f":"IF(D95=\"\", \"\", IF(IFERROR(VLOOKUP(D95, Interview!D:D, 1, FALSE), \"\")<>\"\", \"Yes\", IF(OR(C95=\"Fr\", C95=\"So\", AND(C95=\"Sr\", TODAY()<43646)), \"N/A\", \"No\")))","v":"Yes"}]
["Ming","Chen","Sr","mwc5183",{"$f":"COUNTIF(Event1!$D:$D, D96) + COUNTIF(Event2!$D:$D, D96) + COUNTIF(Event3!$D:$D, D96) + COUNTIF(Event4!$D:$D, D96) + COUNTIF(Event5!$D:$D, D96) + COUNTIF(Event6!$D:$D, D96) + COUNTIF(Event7!$D:$D, D96) + COUNTIF(Event8!$D:$D, D96) + COUNTIF(Event9!$D:$D, D96) + COUNTIF(Event10!$D:$D, D96) + COUNTIF(Event11!$D:$D, D96) + COUNTIF(Event12!$D:$D, D96) + COUNTIF(Event13!$D:$D, D96) + COUNTIF(Event14!$D:$D, D96) + COUNTIF(Event15!$D:$D, D96) + COUNTIF(Event16!$D:$D, D96) + COUNTIF(Event17!$D:$D, D96) + COUNTIF(Event18!$D:$D, D96) + COUNTIF(Event19!$D:$D, D96) + COUNTIF(Event20!$D:$D, D96) + COUNTIF(Event21!$D:$D, D96) + COUNTIF(Event22!$D:$D, D96) + COUNTIF(Event23!$D:$D, D96) + COUNTIF(Event24!$D:$D, D96) + COUNTIF(Event25!$D:$D, D96) + 0","v":4},{"$f":"IF(D96=\"\", \"\", IF(IFERROR(VLOOKUP(D96, Dues!D:D, 1, FALSE), \"\")=\"\", \"No\", \"Yes\"))","v":"No"},{"$f":"IF(D96=\"\", \"\", IF(IFERROR(VLOOKUP(D96, Interview!D:D, 1, FALSE), \"\")<>\"\", \"Yes\", IF(OR(C96=\"Fr\", C96=\"So\", AND(C96=\"Sr\", TODAY()<43646)), \"N/A\", \"No\")))","v":"N/A"}]
["Nathan","Miller","Jr","njm5536",{"$f":"COUNTIF(Event1!$D:$D, D97) + COUNTIF(Event2!$D:$D, D97) + COUNTIF(Event3!$D:$D, D97) + COUNTIF(Event4!$D:$D, D97) + COUNTIF(Event5!$D:$D, D97) + COUNTIF(Event6!$D:$D, D97) + COUNTIF(Event7!$D:$D, D97) + COUNTIF(Event8!$D:$D, D97) + COUNTIF(Event9!$D:$D, D97) + COUNTIF(Event10!$D:$D, D97) + COUNTIF(Event11!$D:$D, D97) + COUNTIF(Event12!$D:$D, D97) + COUNTIF(Event13!$D:$D, D97) + COUNTIF(Event14!$D:$D, D97) + COUNTIF(Event15!$D:$D, D97) + COUNTIF(Event16!$D:$D, D97) + COUNTIF(Event17!$D:$D, D97) + COUNTIF(Event18!$D:$D, D97) + COUNTIF(Event19!$D:$D, D97) + COUNTIF(Event20!$D:$D, D97) + COUNTIF(Event21!$D:$D, D97) + COUNTIF(Event22!$D:$D, D97) + COUNTIF(Event23!$D:$D, D97) + COUNTIF(Event24!$D:$D, D97) + COUNTIF(Event25!$D:$D, D97) + 0","v":4},{"$f":"IF(D97=\"\", \"\", IF(IFERROR(VLOOKUP(D97, Dues!D:D, 1, FALSE), \"\")=\"\", \"No\", \"Yes\"))","v":"No"},{"$f":"IF(D97=\"\", \"\", IF(IFERROR(VLOOKUP(D97, Interview!D:D, 1, FALSE), \"\")<>\"\", \"Yes\", IF(OR(C97=\"Fr\", C97=\"So\", AND(C97=\"Sr\", TODAY()<43646)), \"N/A\", \"No\")))","v":"Yes"}]
["Joe","Esch","Sr","jze5187",{"$f":"COUNTIF(Event1!$D:$D, D98) + COUNTIF(Event2!$D:$D, D98) + COUNTIF(Event3!$D:$D, D98) + COUNTIF(Event4!$D:$D, D98) + COUNTIF(Event5!$D:$D, D98) + COUNTIF(Event6!$D:$D, D98) + COUNTIF(Event7!$D:$D, D98) + COUNTIF(Event8!$D:$D, D98) + COUNTIF(Event9!$D:$D, D98) + COUNTIF(Event10!$D:$D, D98) + COUNTIF(Event11!$D:$D, D98) + COUNTIF(Event12!$D:$D, D98) + COUNTIF(Event13!$D:$D, D98) + COUNTIF(Event14!$D:$D, D98) + COUNTIF(Event15!$D:$D, D98) + COUNTIF(Event16!$D:$D, D98) + COUNTIF(Event17!$D:$D, D98) + COUNTIF(Event18!$D:$D, D98) + COUNTIF(Event19!$D:$D, D98) + COUNTIF(Event20!$D:$D, D98) + COUNTIF(Event21!$D:$D, D98) + COUNTIF(Event22!$D:$D, D98) + COUNTIF(Event23!$D:$D, D98) + COUNTIF(Event24!$D:$D, D98) + COUNTIF(Event25!$D:$D, D98) + 0","v":4},{"$f":"IF(D98=\"\", \"\", IF(IFERROR(VLOOKUP(D98, Dues!D:D, 1, FALSE), \"\")=\"\", \"No\", \"Yes\"))","v":"Yes"},{"$f":"IF(D98=\"\", \"\", IF(IFERROR(VLOOKUP(D98, Interview!D:D, 1, FALSE), \"\")<>\"\", \"Yes\", IF(OR(C98=\"Fr\", C98=\"So\", AND(C98=\"Sr\", TODAY()<43646)), \"N/A\", \"No\")))","v":"N/A"}]
["Kimberly","Anderson","Jr","ksa5170",{"$f":"COUNTIF(Event1!$D:$D, D99) + COUNTIF(Event2!$D:$D, D99) + COUNTIF(Event3!$D:$D, D99) + COUNTIF(Event4!$D:$D, D99) + COUNTIF(Event5!$D:$D, D99) + COUNTIF(Event6!$D:$D, D99) + COUNTIF(Event7!$D:$D, D99) + COUNTIF(Event8!$D:$D, D99) + COUNTIF(Event9!$D:$D, D99) + COUNTIF(Event10!$D:$D, D99) + COUNTIF(Event11!$D:$D, D99) + COUNTIF(Event12!$D:$D, D99) + COUNTIF(Event13!$D:$D, D99) + COUNTIF(Event14!$D:$D, D99) + COUNTIF(Event15!$D:$D, D99) + COUNTIF(Event16!$D:$D, D99) + COUNTIF(Event17!$D:$D, D99) + COUNTIF(Event18!$D:$D, D99) + COUNTIF(Event19!$D:$D, D99) + COUNTIF(Event20!$D:$D, D99) + COUNTIF(Event21!$D:$D, D99) + COUNTIF(Event22!$D:$D, D99) + COUNTIF(Event23!$D:$D, D99) + COUNTIF(Event24!$D:$D, D99) + COUNTIF(Event25!$D:$D, D99) + 0","v":4},{"$f":"IF(D99=\"\", \"\", IF(IFERROR(VLOOKUP(D99, Dues!D:D, 1, FALSE), \"\")=\"\", \"No\", \"Yes\"))","v":"No"},{"$f":"IF(D99=\"\", \"\", IF(IFERROR(VLOOKUP(D99, Interview!D:D, 1, FALSE), \"\")<>\"\", \"Yes\", IF(OR(C99=\"Fr\", C99=\"So\", AND(C99=\"Sr\", TODAY()<43646)), \"N/A\", \"No\")))","v":"Yes"}]
["Michael","Gordon","Sr","mjg5847",{"$f":"COUNTIF(Event1!$D:$D, D100) + COUNTIF(Event2!$D:$D, D100) + COUNTIF(Event3!$D:$D, D100) + COUNTIF(Event4!$D:$D, D100) + COUNTIF(Event5!$D:$D, D100) + COUNTIF(Event6!$D:$D, D100) + COUNTIF(Event7!$D:$D, D100) + COUNTIF(Event8!$D:$D, D100) + COUNTIF(Event9!$D:$D, D100) + COUNTIF(Event10!$D:$D, D100) + COUNTIF(Event11!$D:$D, D100) + COUNTIF(Event12!$D:$D, D100) + COUNTIF(Event13!$D:$D, D100) + COUNTIF(Event14!$D:$D, D100) + COUNTIF(Event15!$D:$D, D100) + COUNTIF(Event16!$D:$D, D100) + COUNTIF(Event17!$D:$D, D100) + COUNTIF(Event18!$D:$D, D100) + COUNTIF(Event19!$D:$D, D100) + COUNTIF(Event20!$D:$D, D100) + COUNTIF(Event21!$D:$D, D100) + COUNTIF(Event22!$D:$D, D100) + COUNTIF(Event23!$D:$D, D100) + COUNTIF(Event24!$D:$D, D100) + COUNTIF(Event25!$D:$D, D100) + 0","v":4},{"$f":"IF(D100=\"\", \"\", IF(IFERROR(VLOOKUP(D100, Dues!D:D, 1, FALSE), \"\")=\"\", \"No\", \"Yes\"))","v":"Yes"},{"$f":"IF(D100=\"\", \"\", IF(IFERROR(VLOOKUP(D100, Interview!D:D, 1, FALSE), \"\")<>\"\", \"Yes\", IF(OR(C100=\"Fr\", C100=\"So\", AND(C100=\"Sr\", TODAY()<43646)), \"N/A\", \"No\")))","v":"N/A"}]
["Greg","Westfall","Fr","gvw5064",{"$f":"COUNTIF(Event1!$D:$D, D101) + COUNTIF(Event2!$D:$D, D101) + COUNTIF(Event3!$D:$D, D101) + COUNTIF(Event4!$D:$D, D101) + COUNTIF(Event5!$D:$D, D101) + COUNTIF(Event6!$D:$D, D101) + COUNTIF(Event7!$D:$D, D101) + COUNTIF(Event8!$D:$D, D101) + COUNTIF(Event9!$D:$D, D101) + COUNTIF(Event10!$D:$D, D101) + COUNTIF(Event11!$D:$D, D101) + COUNTIF(Event12!$D:$D, D101) + COUNTIF(Event13!$D:$D, D101) + COUNTIF(Event14!$D:$D, D101) + COUNTIF(Event15!$D:$D, D101) + COUNTIF(Event16!$D:$D, D101) + COUNTIF(Event17!$D:$D, D101) + COUNTIF(Event18!$D:$D, D101) + COUNTIF(Event19!$D:$D, D101) + COUNTIF(Event20!$D:$D, D101) + COUNTIF(Event21!$D:$D, D101) + COUNTIF(Event22!$D:$D, D101) + COUNTIF(Event23!$D:$D, D101) + COUNTIF(Event24!$D:$D, D101) + COUNTIF(Event25!$D:$D, D101) + 0","v":3},{"$f":"IF(D101=\"\", \"\", IF(IFERROR(VLOOKUP(D101, Dues!D:D, 1, FALSE), \"\")=\"\", \"No\", \"Yes\"))","v":"Yes"},{"$f":"IF(D101=\"\", \"\", IF(IFERROR(VLOOKUP(D101, Interview!D:D, 1, FALSE), \"\")<>\"\", \"Yes\", IF(OR(C101=\"Fr\", C101=\"So\", AND(C101=\"Sr\", TODAY()<43646)), \"N/A\", \"No\")))","v":"N/A"}]
["Jennifer","Davis","So","jrd5822",{"$f":"COUNTIF(Event1!$D:$D, D102) + COUNTIF(Event2!$D:$D, D102) + COUNTIF(Event3!$D:$D, D102) + COUNTIF(Event4!$D:$D, D102) + COUNTIF(Event5!$D:$D, D102) + COUNTIF(Event6!$D:$D, D102) + COUNTIF(Event7!$D:$D, D102) + COUNTIF(Event8!$D:$D, D102) + COUNTIF(Event9!$D:$D, D102) + COUNTIF(Event10!$D:$D, D102) + COUNTIF(Event11!$D:$D, D102) + COUNTIF(Event12!$D:$D, D102) + COUNTIF(Event13!$D:$D, D102) + COUNTIF(Event14!$D:$D, D102) + COUNTIF(Event15!$D:$D, D102) + COUNTIF(Event16!$D:$D, D102) + COUNTIF(Event17!$D:$D, D102) + COUNTIF(Event18!$D:$D, D102) + COUNTIF(Event19!$D:$D, D102) + COUNTIF(Event20!$D:$D, D102) + COUNTIF(Event21!$D:$D, D102) + COUNTIF(Event22!$D:$D, D102) + COUNTIF(Event23!$D:$D, D102) + COUNTIF(Event24!$D:$D, D102) + COUNTIF(Event25!$D:$D, D102) + 0","v":3},{"$f":"IF(D102=\"\", \"\", IF(IFERROR(VLOOKUP(D102, Dues!D:D, 1, FALSE), \"\")=\"\", \"No\", \"Yes\"))","v":"Yes"},{"$f":"IF(D102=\"\", \"\", IF(IFERROR(VLOOKUP(D102, Interview!D:D, 1, FALSE), \"\")<>\"\", \"Yes\", IF(OR(C102=\"Fr\", C102=\"So\", AND(C102=\"Sr\", TODAY()<43646)), \"N/A\", \"No\")))","v":"N/A"}]
["Krystie","Perez-Morales","So","knp5260",{"$f":"COUNTIF(Event1!$D:$D, D103) + COUNTIF(Event2!$D:$D, D103) + COUNTIF(Event3!$D:$D, D103) + COUNTIF(Event4!$D:$D, D103) + COUNTIF(Event5!$D:$D, D103) + COUNTIF(Event6!$D:$D, D103) + COUNTIF(Event7!$D:$D, D103) + COUNTIF(Event8!$D:$D, D103) + COUNTIF(Event9!$D:$D, D103) + COUNTIF(Event10!$D:$D, D103) + COUNTIF(Event11!$D:$D, D103) + COUNTIF(Event12!$D:$D, D103) + COUNTIF(Event13!$D:$D, D103) + COUNTIF(Event14!$D:$D, D103) + COUNTIF(Event15!$D:$D, D103) + COUNTIF(Event16!$D:$D, D103) + COUNTIF(Event17!$D:$D, D103) + COUNTIF(Event18!$D:$D, D103) + COUNTIF(Event19!$D:$D, D103) + COUNTIF(Event20!$D:$D, D103) + COUNTIF(Event21!$D:$D, D103) + COUNTIF(Event22!$D:$D, D103) + COUNTIF(Event23!$D:$D, D103) + COUNTIF(Event24!$D:$D, D103) + COUNTIF(Event25!$D:$D, D103) + 0","v":3},{"$f":"IF(D103=\"\", \"\", IF(IFERROR(VLOOKUP(D103, Dues!D:D, 1, FALSE), \"\")=\"\", \"No\", \"Yes\"))","v":"Yes"},{"$f":"IF(D103=\"\", \"\", IF(IFERROR(VLOOKUP(D103, Interview!D:D, 1, FALSE), \"\")<>\"\", \"Yes\", IF(OR(C103=\"Fr\", C103=\"So\", AND(C103=\"Sr\", TODAY()<43646)), \"N/A\", \"No\")))","v":"N/A"}]
["Konrad","Kai","Fr","Kwk5449",{"$f":"COUNTIF(Event1!$D:$D, D104) + COUNTIF(Event2!$D:$D, D104) + COUNTIF(Event3!$D:$D, D104) + COUNTIF(Event4!$D:$D, D104) + COUNTIF(Event5!$D:$D, D104) + COUNTIF(Event6!$D:$D, D104) + COUNTIF(Event7!$D:$D, D104) + COUNTIF(Event8!$D:$D, D104) + COUNTIF(Event9!$D:$D, D104) + COUNTIF(Event10!$D:$D, D104) + COUNTIF(Event11!$D:$D, D104) + COUNTIF(Event12!$D:$D, D104) + COUNTIF(Event13!$D:$D, D104) + COUNTIF(Event14!$D:$D, D104) + COUNTIF(Event15!$D:$D, D104) + COUNTIF(Event16!$D:$D, D104) + COUNTIF(Event17!$D:$D, D104) + COUNTIF(Event18!$D:$D, D104) + COUNTIF(Event19!$D:$D, D104) + COUNTIF(Event20!$D:$D, D104) + COUNTIF(Event21!$D:$D, D104) + COUNTIF(Event22!$D:$D, D104) + COUNTIF(Event23!$D:$D, D104) + COUNTIF(Event24!$D:$D, D104) + COUNTIF(Event25!$D:$D, D104) + 0","v":3},{"$f":"IF(D104=\"\", \"\", IF(IFERROR(VLOOKUP(D104, Dues!D:D, 1, FALSE), \"\")=\"\", \"No\", \"Yes\"))","v":"Yes"},{"$f":"IF(D104=\"\", \"\", IF(IFERROR(VLOOKUP(D104, Interview!D:D, 1, FALSE), \"\")<>\"\", \"Yes\", IF(OR(C104=\"Fr\", C104=\"So\", AND(C104=\"Sr\", TODAY()<43646)), \"N/A\", \"No\")))","v":"N/A"}]
["Patrick","Voss","Fr","puv44",{"$f":"COUNTIF(Event1!$D:$D, D105) + COUNTIF(Event2!$D:$D, D105) + COUNTIF(Event3!$D:$D, D105) + COUNTIF(Event4!$D:$D, D105) + COUNTIF(Event5!$D:$D, D105) + COUNTIF(Event6!$D:$D, D105) + COUNTIF(Event7!$D:$D, D105) + COUNTIF(Event8!$D:$D, D105) + COUNTIF(Event9!$D:$D, D105) + COUNTIF(Event10!$D:$D, D105) + COUNTIF(Event11!$D:$D, D105) + COUNTIF(Event12!$D:$D, D105) + COUNTIF(Event13!$D:$D, D105) + COUNTIF(Event14!$D:$D, D105) + COUNTIF(Event15!$D:$D, D105) + COUNTIF(Event16!$D:$D, D105) + COUNTIF(Event17!$D:$D, D105) + COUNTIF(Event18!$D:$D, D105) + COUNTIF(Event19!$D:$D, D105) + COUNTIF(Event20!$D:$D, D105) + COUNTIF(Event21!$D:$D, D105) + COUNTIF(Event22!$D:$D, D105) + COUNTIF(Event23!$D:$D, D105) + COUNTIF(Event24!$D:$D, D105) + COUNTIF(Event25!$D:$D, D105) + 0","v":3},{"$f":"IF(D105=\"\", \"\", IF(IFERROR(VLOOKUP(D105, Dues!D:D, 1, FALSE), \"\")=\"\", \"No\", \"Yes\"))","v":"Yes"},{"$f":"IF(D105=\"\", \"\", IF(IFERROR(VLOOKUP(D105, Interview!D:D, 1, FALSE), \"\")<>\"\", \"Yes\", IF(OR(C105=\"Fr\", C105=\"So\", AND(C105=\"Sr\", TODAY()<43646)), \"N/A\", \"No\")))","v":"N/A"}]
["Alex","Hartman","So","auh363",{"$f":"COUNTIF(Event1!$D:$D, D106) + COUNTIF(Event2!$D:$D, D106) + COUNTIF(Event3!$D:$D, D106) + COUNTIF(Event4!$D:$D, D106) + COUNTIF(Event5!$D:$D, D106) + COUNTIF(Event6!$D:$D, D106) + COUNTIF(Event7!$D:$D, D106) + COUNTIF(Event8!$D:$D, D106) + COUNTIF(Event9!$D:$D, D106) + COUNTIF(Event10!$D:$D, D106) + COUNTIF(Event11!$D:$D, D106) + COUNTIF(Event12!$D:$D, D106) + COUNTIF(Event13!$D:$D, D106) + COUNTIF(Event14!$D:$D, D106) + COUNTIF(Event15!$D:$D, D106) + COUNTIF(Event16!$D:$D, D106) + COUNTIF(Event17!$D:$D, D106) + COUNTIF(Event18!$D:$D, D106) + COUNTIF(Event19!$D:$D, D106) + COUNTIF(Event20!$D:$D, D106) + COUNTIF(Event21!$D:$D, D106) + COUNTIF(Event22!$D:$D, D106) + COUNTIF(Event23!$D:$D, D106) + COUNTIF(Event24!$D:$D, D106) + COUNTIF(Event25!$D:$D, D106) + 0","v":3},{"$f":"IF(D106=\"\", \"\", IF(IFERROR(VLOOKUP(D106, Dues!D:D, 1, FALSE), \"\")=\"\", \"No\", \"Yes\"))","v":"Yes"},{"$f":"IF(D106=\"\", \"\", IF(IFERROR(VLOOKUP(D106, Interview!D:D, 1, FALSE), \"\")<>\"\", \"Yes\", IF(OR(C106=\"Fr\", C106=\"So\", AND(C106=\"Sr\", TODAY()<43646)), \"N/A\", \"No\")))","v":"N/A"}]
["Jeremy","Williams","Jr","jsw5439",{"$f":"COUNTIF(Event1!$D:$D, D107) + COUNTIF(Event2!$D:$D, D107) + COUNTIF(Event3!$D:$D, D107) + COUNTIF(Event4!$D:$D, D107) + COUNTIF(Event5!$D:$D, D107) + COUNTIF(Event6!$D:$D, D107) + COUNTIF(Event7!$D:$D, D107) + COUNTIF(Event8!$D:$D, D107) + COUNTIF(Event9!$D:$D, D107) + COUNTIF(Event10!$D:$D, D107) + COUNTIF(Event11!$D:$D, D107) + COUNTIF(Event12!$D:$D, D107) + COUNTIF(Event13!$D:$D, D107) + COUNTIF(Event14!$D:$D, D107) + COUNTIF(Event15!$D:$D, D107) + COUNTIF(Event16!$D:$D, D107) + COUNTIF(Event17!$D:$D, D107) + COUNTIF(Event18!$D:$D, D107) + COUNTIF(Event19!$D:$D, D107) + COUNTIF(Event20!$D:$D, D107) + COUNTIF(Event21!$D:$D, D107) + COUNTIF(Event22!$D:$D, D107) + COUNTIF(Event23!$D:$D, D107) + COUNTIF(Event24!$D:$D, D107) + COUNTIF(Event25!$D:$D, D107) + 0","v":3},{"$f":"IF(D107=\"\", \"\", IF(IFERROR(VLOOKUP(D107, Dues!D:D, 1, FALSE), \"\")=\"\", \"No\", \"Yes\"))","v":"Yes"},{"$f":"IF(D107=\"\", \"\", IF(IFERROR(VLOOKUP(D107, Interview!D:D, 1, FALSE), \"\")<>\"\", \"Yes\", IF(OR(C107=\"Fr\", C107=\"So\", AND(C107=\"Sr\", TODAY()<43646)), \"N/A\", \"No\")))","v":"No"}]
["Carmen","Veltri","Fr","cpv5095",{"$f":"COUNTIF(Event1!$D:$D, D108) + COUNTIF(Event2!$D:$D, D108) + COUNTIF(Event3!$D:$D, D108) + COUNTIF(Event4!$D:$D, D108) + COUNTIF(Event5!$D:$D, D108) + COUNTIF(Event6!$D:$D, D108) + COUNTIF(Event7!$D:$D, D108) + COUNTIF(Event8!$D:$D, D108) + COUNTIF(Event9!$D:$D, D108) + COUNTIF(Event10!$D:$D, D108) + COUNTIF(Event11!$D:$D, D108) + COUNTIF(Event12!$D:$D, D108) + COUNTIF(Event13!$D:$D, D108) + COUNTIF(Event14!$D:$D, D108) + COUNTIF(Event15!$D:$D, D108) + COUNTIF(Event16!$D:$D, D108) + COUNTIF(Event17!$D:$D, D108) + COUNTIF(Event18!$D:$D, D108) + COUNTIF(Event19!$D:$D, D108) + COUNTIF(Event20!$D:$D, D108) + COUNTIF(Event21!$D:$D, D108) + COUNTIF(Event22!$D:$D, D108) + COUNTIF(Event23!$D:$D, D108) + COUNTIF(Event24!$D:$D, D108) + COUNTIF(Event25!$D:$D, D108) + 0","v":3},{"$f":"IF(D108=\"\", \"\", IF(IFERROR(VLOOKUP(D108, Dues!D:D, 1, FALSE), \"\")=\"\", \"No\", \"Yes\"))","v":"Yes"},{"$f":"IF(D108=\"\", \"\", IF(IFERROR(VLOOKUP(D108, Interview!D:D, 1, FALSE), \"\")<>\"\", \"Yes\", IF(OR(C108=\"Fr\", C108=\"So\", AND(C108=\"Sr\", TODAY()<43646)), \"N/A\", \"No\")))","v":"N/A"}]
["Geoffrey","Barratt","Fr","gxb92",{"$f":"COUNTIF(Event1!$D:$D, D109) + COUNTIF(Event2!$D:$D, D109) + COUNTIF(Event3!$D:$D, D109) + COUNTIF(Event4!$D:$D, D109) + COUNTIF(Event5!$D:$D, D109) + COUNTIF(Event6!$D:$D, D109) + COUNTIF(Event7!$D:$D, D109) + COUNTIF(Event8!$D:$D, D109) + COUNTIF(Event9!$D:$D, D109) + COUNTIF(Event10!$D:$D, D109) + COUNTIF(Event11!$D:$D, D109) + COUNTIF(Event12!$D:$D, D109) + COUNTIF(Event13!$D:$D, D109) + COUNTIF(Event14!$D:$D, D109) + COUNTIF(Event15!$D:$D, D109) + COUNTIF(Event16!$D:$D, D109) + COUNTIF(Event17!$D:$D, D109) + COUNTIF(Event18!$D:$D, D109) + COUNTIF(Event19!$D:$D, D109) + COUNTIF(Event20!$D:$D, D109) + COUNTIF(Event21!$D:$D, D109) + COUNTIF(Event22!$D:$D, D109) + COUNTIF(Event23!$D:$D, D109) + COUNTIF(Event24!$D:$D, D109) + COUNTIF(Event25!$D:$D, D109) + 0","v":3},{"$f":"IF(D109=\"\", \"\", IF(IFERROR(VLOOKUP(D109, Dues!D:D, 1, FALSE), \"\")=\"\", \"No\", \"Yes\"))","v":"Yes"},{"$f":"IF(D109=\"\", \"\", IF(IFERROR(VLOOKUP(D109, Interview!D:D, 1, FALSE), \"\")<>\"\", \"Yes\", IF(OR(C109=\"Fr\", C109=\"So\", AND(C109=\"Sr\", TODAY()<43646)), \"N/A\", \"No\")))","v":"N/A"}]
["Kevin","Chow","Sr ","kbc5228",{"$f":"COUNTIF(Event1!$D:$D, D110) + COUNTIF(Event2!$D:$D, D110) + COUNTIF(Event3!$D:$D, D110) + COUNTIF(Event4!$D:$D, D110) + COUNTIF(Event5!$D:$D, D110) + COUNTIF(Event6!$D:$D, D110) + COUNTIF(Event7!$D:$D, D110) + COUNTIF(Event8!$D:$D, D110) + COUNTIF(Event9!$D:$D, D110) + COUNTIF(Event10!$D:$D, D110) + COUNTIF(Event11!$D:$D, D110) + COUNTIF(Event12!$D:$D, D110) + COUNTIF(Event13!$D:$D, D110) + COUNTIF(Event14!$D:$D, D110) + COUNTIF(Event15!$D:$D, D110) + COUNTIF(Event16!$D:$D, D110) + COUNTIF(Event17!$D:$D, D110) + COUNTIF(Event18!$D:$D, D110) + COUNTIF(Event19!$D:$D, D110) + COUNTIF(Event20!$D:$D, D110) + COUNTIF(Event21!$D:$D, D110) + COUNTIF(Event22!$D:$D, D110) + COUNTIF(Event23!$D:$D, D110) + COUNTIF(Event24!$D:$D, D110) + COUNTIF(Event25!$D:$D, D110) + 0","v":3},{"$f":"IF(D110=\"\", \"\", IF(IFERROR(VLOOKUP(D110, Dues!D:D, 1, FALSE), \"\")=\"\", \"No\", \"Yes\"))","v":"Yes"},{"$f":"IF(D110=\"\", \"\", IF(IFERROR(VLOOKUP(D110, Interview!D:D, 1, FALSE), \"\")<>\"\", \"Yes\", IF(OR(C110=\"Fr\", C110=\"So\", AND(C110=\"Sr\", TODAY()<43646)), \"N/A\", \"No\")))","v":"No"}]
["Nathan","Newman","So","ngn5017",{"$f":"COUNTIF(Event1!$D:$D, D111) + COUNTIF(Event2!$D:$D, D111) + COUNTIF(Event3!$D:$D, D111) + COUNTIF(Event4!$D:$D, D111) + COUNTIF(Event5!$D:$D, D111) + COUNTIF(Event6!$D:$D, D111) + COUNTIF(Event7!$D:$D, D111) + COUNTIF(Event8!$D:$D, D111) + COUNTIF(Event9!$D:$D, D111) + COUNTIF(Event10!$D:$D, D111) + COUNTIF(Event11!$D:$D, D111) + COUNTIF(Event12!$D:$D, D111) + COUNTIF(Event13!$D:$D, D111) + COUNTIF(Event14!$D:$D, D111) + COUNTIF(Event15!$D:$D, D111) + COUNTIF(Event16!$D:$D, D111) + COUNTIF(Event17!$D:$D, D111) + COUNTIF(Event18!$D:$D, D111) + COUNTIF(Event19!$D:$D, D111) + COUNTIF(Event20!$D:$D, D111) + COUNTIF(Event21!$D:$D, D111) + COUNTIF(Event22!$D:$D, D111) + COUNTIF(Event23!$D:$D, D111) + COUNTIF(Event24!$D:$D, D111) + COUNTIF(Event25!$D:$D, D111) + 0","v":3},{"$f":"IF(D111=\"\", \"\", IF(IFERROR(VLOOKUP(D111, Dues!D:D, 1, FALSE), \"\")=\"\", \"No\", \"Yes\"))","v":"Yes"},{"$f":"IF(D111=\"\", \"\", IF(IFERROR(VLOOKUP(D111, Interview!D:D, 1, FALSE), \"\")<>\"\", \"Yes\", IF(OR(C111=\"Fr\", C111=\"So\", AND(C111=\"Sr\", TODAY()<43646)), \"N/A\", \"No\")))","v":"N/A"}]
["Mei Ying ","Tan","Sr","mut77",{"$f":"COUNTIF(Event1!$D:$D, D112) + COUNTIF(Event2!$D:$D, D112) + COUNTIF(Event3!$D:$D, D112) + COUNTIF(Event4!$D:$D, D112) + COUNTIF(Event5!$D:$D, D112) + COUNTIF(Event6!$D:$D, D112) + COUNTIF(Event7!$D:$D, D112) + COUNTIF(Event8!$D:$D, D112) + COUNTIF(Event9!$D:$D, D112) + COUNTIF(Event10!$D:$D, D112) + COUNTIF(Event11!$D:$D, D112) + COUNTIF(Event12!$D:$D, D112) + COUNTIF(Event13!$D:$D, D112) + COUNTIF(Event14!$D:$D, D112) + COUNTIF(Event15!$D:$D, D112) + COUNTIF(Event16!$D:$D, D112) + COUNTIF(Event17!$D:$D, D112) + COUNTIF(Event18!$D:$D, D112) + COUNTIF(Event19!$D:$D, D112) + COUNTIF(Event20!$D:$D, D112) + COUNTIF(Event21!$D:$D, D112) + COUNTIF(Event22!$D:$D, D112) + COUNTIF(Event23!$D:$D, D112) + COUNTIF(Event24!$D:$D, D112) + COUNTIF(Event25!$D:$D, D112) + 0","v":3},{"$f":"IF(D112=\"\", \"\", IF(IFERROR(VLOOKUP(D112, Dues!D:D, 1, FALSE), \"\")=\"\", \"No\", \"Yes\"))","v":"Yes"},{"$f":"IF(D112=\"\", \"\", IF(IFERROR(VLOOKUP(D112, Interview!D:D, 1, FALSE), \"\")<>\"\", \"Yes\", IF(OR(C112=\"Fr\", C112=\"So\", AND(C112=\"Sr\", TODAY()<43646)), \"N/A\", \"No\")))","v":"N/A"}]
["Frankie","Haver","Jr","fph5023",{"$f":"COUNTIF(Event1!$D:$D, D113) + COUNTIF(Event2!$D:$D, D113) + COUNTIF(Event3!$D:$D, D113) + COUNTIF(Event4!$D:$D, D113) + COUNTIF(Event5!$D:$D, D113) + COUNTIF(Event6!$D:$D, D113) + COUNTIF(Event7!$D:$D, D113) + COUNTIF(Event8!$D:$D, D113) + COUNTIF(Event9!$D:$D, D113) + COUNTIF(Event10!$D:$D, D113) + COUNTIF(Event11!$D:$D, D113) + COUNTIF(Event12!$D:$D, D113) + COUNTIF(Event13!$D:$D, D113) + COUNTIF(Event14!$D:$D, D113) + COUNTIF(Event15!$D:$D, D113) + COUNTIF(Event16!$D:$D, D113) + COUNTIF(Event17!$D:$D, D113) + COUNTIF(Event18!$D:$D, D113) + COUNTIF(Event19!$D:$D, D113) + COUNTIF(Event20!$D:$D, D113) + COUNTIF(Event21!$D:$D, D113) + COUNTIF(Event22!$D:$D, D113) + COUNTIF(Event23!$D:$D, D113) + COUNTIF(Event24!$D:$D, D113) + COUNTIF(Event25!$D:$D, D113) + 0","v":3},{"$f":"IF(D113=\"\", \"\", IF(IFERROR(VLOOKUP(D113, Dues!D:D, 1, FALSE), \"\")=\"\", \"No\", \"Yes\"))","v":"Yes"},{"$f":"IF(D113=\"\", \"\", IF(IFERROR(VLOOKUP(D113, Interview!D:D, 1, FALSE), \"\")<>\"\", \"Yes\", IF(OR(C113=\"Fr\", C113=\"So\", AND(C113=\"Sr\", TODAY()<43646)), \"N/A\", \"No\")))","v":"Yes"}]
["Alex","Arena","Jr","afa5399",{"$f":"COUNTIF(Event1!$D:$D, D114) + COUNTIF(Event2!$D:$D, D114) + COUNTIF(Event3!$D:$D, D114) + COUNTIF(Event4!$D:$D, D114) + COUNTIF(Event5!$D:$D, D114) + COUNTIF(Event6!$D:$D, D114) + COUNTIF(Event7!$D:$D, D114) + COUNTIF(Event8!$D:$D, D114) + COUNTIF(Event9!$D:$D, D114) + COUNTIF(Event10!$D:$D, D114) + COUNTIF(Event11!$D:$D, D114) + COUNTIF(Event12!$D:$D, D114) + COUNTIF(Event13!$D:$D, D114) + COUNTIF(Event14!$D:$D, D114) + COUNTIF(Event15!$D:$D, D114) + COUNTIF(Event16!$D:$D, D114) + COUNTIF(Event17!$D:$D, D114) + COUNTIF(Event18!$D:$D, D114) + COUNTIF(Event19!$D:$D, D114) + COUNTIF(Event20!$D:$D, D114) + COUNTIF(Event21!$D:$D, D114) + COUNTIF(Event22!$D:$D, D114) + COUNTIF(Event23!$D:$D, D114) + COUNTIF(Event24!$D:$D, D114) + COUNTIF(Event25!$D:$D, D114) + 0","v":3},{"$f":"IF(D114=\"\", \"\", IF(IFERROR(VLOOKUP(D114, Dues!D:D, 1, FALSE), \"\")=\"\", \"No\", \"Yes\"))","v":"Yes"},{"$f":"IF(D114=\"\", \"\", IF(IFERROR(VLOOKUP(D114, Interview!D:D, 1, FALSE), \"\")<>\"\", \"Yes\", IF(OR(C114=\"Fr\", C114=\"So\", AND(C114=\"Sr\", TODAY()<43646)), \"N/A\", \"No\")))","v":"Yes"}]
["Ryan ","Voyack","Sr","rjv5140",{"$f":"COUNTIF(Event1!$D:$D, D115) + COUNTIF(Event2!$D:$D, D115) + COUNTIF(Event3!$D:$D, D115) + COUNTIF(Event4!$D:$D, D115) + COUNTIF(Event5!$D:$D, D115) + COUNTIF(Event6!$D:$D, D115) + COUNTIF(Event7!$D:$D, D115) + COUNTIF(Event8!$D:$D, D115) + COUNTIF(Event9!$D:$D, D115) + COUNTIF(Event10!$D:$D, D115) + COUNTIF(Event11!$D:$D, D115) + COUNTIF(Event12!$D:$D, D115) + COUNTIF(Event13!$D:$D, D115) + COUNTIF(Event14!$D:$D, D115) + COUNTIF(Event15!$D:$D, D115) + COUNTIF(Event16!$D:$D, D115) + COUNTIF(Event17!$D:$D, D115) + COUNTIF(Event18!$D:$D, D115) + COUNTIF(Event19!$D:$D, D115) + COUNTIF(Event20!$D:$D, D115) + COUNTIF(Event21!$D:$D, D115) + COUNTIF(Event22!$D:$D, D115) + COUNTIF(Event23!$D:$D, D115) + COUNTIF(Event24!$D:$D, D115) + COUNTIF(Event25!$D:$D, D115) + 0","v":3},{"$f":"IF(D115=\"\", \"\", IF(IFERROR(VLOOKUP(D115, Dues!D:D, 1, FALSE), \"\")=\"\", \"No\", \"Yes\"))","v":"Yes"},{"$f":"IF(D115=\"\", \"\", IF(IFERROR(VLOOKUP(D115, Interview!D:D, 1, FALSE), \"\")<>\"\", \"Yes\", IF(OR(C115=\"Fr\", C115=\"So\", AND(C115=\"Sr\", TODAY()<43646)), \"N/A\", \"No\")))","v":"N/A"}]
["Rachel","Weber","Jr","rhw5080",{"$f":"COUNTIF(Event1!$D:$D, D116) + COUNTIF(Event2!$D:$D, D116) + COUNTIF(Event3!$D:$D, D116) + COUNTIF(Event4!$D:$D, D116) + COUNTIF(Event5!$D:$D, D116) + COUNTIF(Event6!$D:$D, D116) + COUNTIF(Event7!$D:$D, D116) + COUNTIF(Event8!$D:$D, D116) + COUNTIF(Event9!$D:$D, D116) + COUNTIF(Event10!$D:$D, D116) + COUNTIF(Event11!$D:$D, D116) + COUNTIF(Event12!$D:$D, D116) + COUNTIF(Event13!$D:$D, D116) + COUNTIF(Event14!$D:$D, D116) + COUNTIF(Event15!$D:$D, D116) + COUNTIF(Event16!$D:$D, D116) + COUNTIF(Event17!$D:$D, D116) + COUNTIF(Event18!$D:$D, D116) + COUNTIF(Event19!$D:$D, D116) + COUNTIF(Event20!$D:$D, D116) + COUNTIF(Event21!$D:$D, D116) + COUNTIF(Event22!$D:$D, D116) + COUNTIF(Event23!$D:$D, D116) + COUNTIF(Event24!$D:$D, D116) + COUNTIF(Event25!$D:$D, D116) + 0","v":3},{"$f":"IF(D116=\"\", \"\", IF(IFERROR(VLOOKUP(D116, Dues!D:D, 1, FALSE), \"\")=\"\", \"No\", \"Yes\"))","v":"Yes"},{"$f":"IF(D116=\"\", \"\", IF(IFERROR(VLOOKUP(D116, Interview!D:D, 1, FALSE), \"\")<>\"\", \"Yes\", IF(OR(C116=\"Fr\", C116=\"So\", AND(C116=\"Sr\", TODAY()<43646)), \"N/A\", \"No\")))","v":"Yes"}]
["Connor","Grabowski","Jr","ctg5142",{"$f":"COUNTIF(Event1!$D:$D, D117) + COUNTIF(Event2!$D:$D, D117) + COUNTIF(Event3!$D:$D, D117) + COUNTIF(Event4!$D:$D, D117) + COUNTIF(Event5!$D:$D, D117) + COUNTIF(Event6!$D:$D, D117) + COUNTIF(Event7!$D:$D, D117) + COUNTIF(Event8!$D:$D, D117) + COUNTIF(Event9!$D:$D, D117) + COUNTIF(Event10!$D:$D, D117) + COUNTIF(Event11!$D:$D, D117) + COUNTIF(Event12!$D:$D, D117) + COUNTIF(Event13!$D:$D, D117) + COUNTIF(Event14!$D:$D, D117) + COUNTIF(Event15!$D:$D, D117) + COUNTIF(Event16!$D:$D, D117) + COUNTIF(Event17!$D:$D, D117) + COUNTIF(Event18!$D:$D, D117) + COUNTIF(Event19!$D:$D, D117) + COUNTIF(Event20!$D:$D, D117) + COUNTIF(Event21!$D:$D, D117) + COUNTIF(Event22!$D:$D, D117) + COUNTIF(Event23!$D:$D, D117) + COUNTIF(Event24!$D:$D, D117) + COUNTIF(Event25!$D:$D, D117) + 0","v":3},{"$f":"IF(D117=\"\", \"\", IF(IFERROR(VLOOKUP(D117, Dues!D:D, 1, FALSE), \"\")=\"\", \"No\", \"Yes\"))","v":"Yes"},{"$f":"IF(D117=\"\", \"\", IF(IFERROR(VLOOKUP(D117, Interview!D:D, 1, FALSE), \"\")<>\"\", \"Yes\", IF(OR(C117=\"Fr\", C117=\"So\", AND(C117=\"Sr\", TODAY()<43646)), \"N/A\", \"No\")))","v":"Yes"}]
["Shreya","Bibra","Fr","svb6003",{"$f":"COUNTIF(Event1!$D:$D, D118) + COUNTIF(Event2!$D:$D, D118) + COUNTIF(Event3!$D:$D, D118) + COUNTIF(Event4!$D:$D, D118) + COUNTIF(Event5!$D:$D, D118) + COUNTIF(Event6!$D:$D, D118) + COUNTIF(Event7!$D:$D, D118) + COUNTIF(Event8!$D:$D, D118) + COUNTIF(Event9!$D:$D, D118) + COUNTIF(Event10!$D:$D, D118) + COUNTIF(Event11!$D:$D, D118) + COUNTIF(Event12!$D:$D, D118) + COUNTIF(Event13!$D:$D, D118) + COUNTIF(Event14!$D:$D, D118) + COUNTIF(Event15!$D:$D, D118) + COUNTIF(Event16!$D:$D, D118) + COUNTIF(Event17!$D:$D, D118) + COUNTIF(Event18!$D:$D, D118) + COUNTIF(Event19!$D:$D, D118) + COUNTIF(Event20!$D:$D, D118) + COUNTIF(Event21!$D:$D, D118) + COUNTIF(Event22!$D:$D, D118) + COUNTIF(Event23!$D:$D, D118) + COUNTIF(Event24!$D:$D, D118) + COUNTIF(Event25!$D:$D, D118) + 0","v":3},{"$f":"IF(D118=\"\", \"\", IF(IFERROR(VLOOKUP(D118, Dues!D:D, 1, FALSE), \"\")=\"\", \"No\", \"Yes\"))","v":"No"},{"$f":"IF(D118=\"\", \"\", IF(IFERROR(VLOOKUP(D118, Interview!D:D, 1, FALSE), \"\")<>\"\", \"Yes\", IF(OR(C118=\"Fr\", C118=\"So\", AND(C118=\"Sr\", TODAY()<43646)), \"N/A\", \"No\")))","v":"N/A"}]
["Cristina","Peloro","Fr","czp5434",{"$f":"COUNTIF(Event1!$D:$D, D119) + COUNTIF(Event2!$D:$D, D119) + COUNTIF(Event3!$D:$D, D119) + COUNTIF(Event4!$D:$D, D119) + COUNTIF(Event5!$D:$D, D119) + COUNTIF(Event6!$D:$D, D119) + COUNTIF(Event7!$D:$D, D119) + COUNTIF(Event8!$D:$D, D119) + COUNTIF(Event9!$D:$D, D119) + COUNTIF(Event10!$D:$D, D119) + COUNTIF(Event11!$D:$D, D119) + COUNTIF(Event12!$D:$D, D119) + COUNTIF(Event13!$D:$D, D119) + COUNTIF(Event14!$D:$D, D119) + COUNTIF(Event15!$D:$D, D119) + COUNTIF(Event16!$D:$D, D119) + COUNTIF(Event17!$D:$D, D119) + COUNTIF(Event18!$D:$D, D119) + COUNTIF(Event19!$D:$D, D119) + COUNTIF(Event20!$D:$D, D119) + COUNTIF(Event21!$D:$D, D119) + COUNTIF(Event22!$D:$D, D119) + COUNTIF(Event23!$D:$D, D119) + COUNTIF(Event24!$D:$D, D119) + COUNTIF(Event25!$D:$D, D119) + 0","v":3},{"$f":"IF(D119=\"\", \"\", IF(IFERROR(VLOOKUP(D119, Dues!D:D, 1, FALSE), \"\")=\"\", \"No\", \"Yes\"))","v":"No"},{"$f":"IF(D119=\"\", \"\", IF(IFERROR(VLOOKUP(D119, Interview!D:D, 1, FALSE), \"\")<>\"\", \"Yes\", IF(OR(C119=\"Fr\", C119=\"So\", AND(C119=\"Sr\", TODAY()<43646)), \"N/A\", \"No\")))","v":"N/A"}]
["Alexis","Lasko","Jr","all5680",{"$f":"COUNTIF(Event1!$D:$D, D120) + COUNTIF(Event2!$D:$D, D120) + COUNTIF(Event3!$D:$D, D120) + COUNTIF(Event4!$D:$D, D120) + COUNTIF(Event5!$D:$D, D120) + COUNTIF(Event6!$D:$D, D120) + COUNTIF(Event7!$D:$D, D120) + COUNTIF(Event8!$D:$D, D120) + COUNTIF(Event9!$D:$D, D120) + COUNTIF(Event10!$D:$D, D120) + COUNTIF(Event11!$D:$D, D120) + COUNTIF(Event12!$D:$D, D120) + COUNTIF(Event13!$D:$D, D120) + COUNTIF(Event14!$D:$D, D120) + COUNTIF(Event15!$D:$D, D120) + COUNTIF(Event16!$D:$D, D120) + COUNTIF(Event17!$D:$D, D120) + COUNTIF(Event18!$D:$D, D120) + COUNTIF(Event19!$D:$D, D120) + COUNTIF(Event20!$D:$D, D120) + COUNTIF(Event21!$D:$D, D120) + COUNTIF(Event22!$D:$D, D120) + COUNTIF(Event23!$D:$D, D120) + COUNTIF(Event24!$D:$D, D120) + COUNTIF(Event25!$D:$D, D120) + 0","v":3},{"$f":"IF(D120=\"\", \"\", IF(IFERROR(VLOOKUP(D120, Dues!D:D, 1, FALSE), \"\")=\"\", \"No\", \"Yes\"))","v":"No"},{"$f":"IF(D120=\"\", \"\", IF(IFERROR(VLOOKUP(D120, Interview!D:D, 1, FALSE), \"\")<>\"\", \"Yes\", IF(OR(C120=\"Fr\", C120=\"So\", AND(C120=\"Sr\", TODAY()<43646)), \"N/A\", \"No\")))","v":"No"}]
["Zijing","Cui","Sr","zjc5108",{"$f":"COUNTIF(Event1!$D:$D, D121) + COUNTIF(Event2!$D:$D, D121) + COUNTIF(Event3!$D:$D, D121) + COUNTIF(Event4!$D:$D, D121) + COUNTIF(Event5!$D:$D, D121) + COUNTIF(Event6!$D:$D, D121) + COUNTIF(Event7!$D:$D, D121) + COUNTIF(Event8!$D:$D, D121) + COUNTIF(Event9!$D:$D, D121) + COUNTIF(Event10!$D:$D, D121) + COUNTIF(Event11!$D:$D, D121) + COUNTIF(Event12!$D:$D, D121) + COUNTIF(Event13!$D:$D, D121) + COUNTIF(Event14!$D:$D, D121) + COUNTIF(Event15!$D:$D, D121) + COUNTIF(Event16!$D:$D, D121) + COUNTIF(Event17!$D:$D, D121) + COUNTIF(Event18!$D:$D, D121) + COUNTIF(Event19!$D:$D, D121) + COUNTIF(Event20!$D:$D, D121) + COUNTIF(Event21!$D:$D, D121) + COUNTIF(Event22!$D:$D, D121) + COUNTIF(Event23!$D:$D, D121) + COUNTIF(Event24!$D:$D, D121) + COUNTIF(Event25!$D:$D, D121) + 0","v":3},{"$f":"IF(D121=\"\", \"\", IF(IFERROR(VLOOKUP(D121, Dues!D:D, 1, FALSE), \"\")=\"\", \"No\", \"Yes\"))","v":"No"},{"$f":"IF(D121=\"\", \"\", IF(IFERROR(VLOOKUP(D121, Interview!D:D, 1, FALSE), \"\")<>\"\", \"Yes\", IF(OR(C121=\"Fr\", C121=\"So\", AND(C121=\"Sr\", TODAY()<43646)), \"N/A\", \"No\")))","v":"N/A"}]
["Marko","Resetar","Sr","mvr5349",{"$f":"COUNTIF(Event1!$D:$D, D122) + COUNTIF(Event2!$D:$D, D122) + COUNTIF(Event3!$D:$D, D122) + COUNTIF(Event4!$D:$D, D122) + COUNTIF(Event5!$D:$D, D122) + COUNTIF(Event6!$D:$D, D122) + COUNTIF(Event7!$D:$D, D122) + COUNTIF(Event8!$D:$D, D122) + COUNTIF(Event9!$D:$D, D122) + COUNTIF(Event10!$D:$D, D122) + COUNTIF(Event11!$D:$D, D122) + COUNTIF(Event12!$D:$D, D122) + COUNTIF(Event13!$D:$D, D122) + COUNTIF(Event14!$D:$D, D122) + COUNTIF(Event15!$D:$D, D122) + COUNTIF(Event16!$D:$D, D122) + COUNTIF(Event17!$D:$D, D122) + COUNTIF(Event18!$D:$D, D122) + COUNTIF(Event19!$D:$D, D122) + COUNTIF(Event20!$D:$D, D122) + COUNTIF(Event21!$D:$D, D122) + COUNTIF(Event22!$D:$D, D122) + COUNTIF(Event23!$D:$D, D122) + COUNTIF(Event24!$D:$D, D122) + COUNTIF(Event25!$D:$D, D122) + 0","v":3},{"$f":"IF(D122=\"\", \"\", IF(IFERROR(VLOOKUP(D122, Dues!D:D, 1, FALSE), \"\")=\"\", \"No\", \"Yes\"))","v":"Yes"},{"$f":"IF(D122=\"\", \"\", IF(IFERROR(VLOOKUP(D122, Interview!D:D, 1, FALSE), \"\")<>\"\", \"Yes\", IF(OR(C122=\"Fr\", C122=\"So\", AND(C122=\"Sr\", TODAY()<43646)), \"N/A\", \"No\")))","v":"N/A"}]
["Avery","Ryan","So","aer5483",{"$f":"COUNTIF(Event1!$D:$D, D123) + COUNTIF(Event2!$D:$D, D123) + COUNTIF(Event3!$D:$D, D123) + COUNTIF(Event4!$D:$D, D123) + COUNTIF(Event5!$D:$D, D123) + COUNTIF(Event6!$D:$D, D123) + COUNTIF(Event7!$D:$D, D123) + COUNTIF(Event8!$D:$D, D123) + COUNTIF(Event9!$D:$D, D123) + COUNTIF(Event10!$D:$D, D123) + COUNTIF(Event11!$D:$D, D123) + COUNTIF(Event12!$D:$D, D123) + COUNTIF(Event13!$D:$D, D123) + COUNTIF(Event14!$D:$D, D123) + COUNTIF(Event15!$D:$D, D123) + COUNTIF(Event16!$D:$D, D123) + COUNTIF(Event17!$D:$D, D123) + COUNTIF(Event18!$D:$D, D123) + COUNTIF(Event19!$D:$D, D123) + COUNTIF(Event20!$D:$D, D123) + COUNTIF(Event21!$D:$D, D123) + COUNTIF(Event22!$D:$D, D123) + COUNTIF(Event23!$D:$D, D123) + COUNTIF(Event24!$D:$D, D123) + COUNTIF(Event25!$D:$D, D123) + 0","v":3},{"$f":"IF(D123=\"\", \"\", IF(IFERROR(VLOOKUP(D123, Dues!D:D, 1, FALSE), \"\")=\"\", \"No\", \"Yes\"))","v":"No"},{"$f":"IF(D123=\"\", \"\", IF(IFERROR(VLOOKUP(D123, Interview!D:D, 1, FALSE), \"\")<>\"\", \"Yes\", IF(OR(C123=\"Fr\", C123=\"So\", AND(C123=\"Sr\", TODAY()<43646)), \"N/A\", \"No\")))","v":"N/A"}]
["Zhengyan","Yuan","Jr","zqy5133",{"$f":"COUNTIF(Event1!$D:$D, D124) + COUNTIF(Event2!$D:$D, D124) + COUNTIF(Event3!$D:$D, D124) + COUNTIF(Event4!$D:$D, D124) + COUNTIF(Event5!$D:$D, D124) + COUNTIF(Event6!$D:$D, D124) + COUNTIF(Event7!$D:$D, D124) + COUNTIF(Event8!$D:$D, D124) + COUNTIF(Event9!$D:$D, D124) + COUNTIF(Event10!$D:$D, D124) + COUNTIF(Event11!$D:$D, D124) + COUNTIF(Event12!$D:$D, D124) + COUNTIF(Event13!$D:$D, D124) + COUNTIF(Event14!$D:$D, D124) + COUNTIF(Event15!$D:$D, D124) + COUNTIF(Event16!$D:$D, D124) + COUNTIF(Event17!$D:$D, D124) + COUNTIF(Event18!$D:$D, D124) + COUNTIF(Event19!$D:$D, D124) + COUNTIF(Event20!$D:$D, D124) + COUNTIF(Event21!$D:$D, D124) + COUNTIF(Event22!$D:$D, D124) + COUNTIF(Event23!$D:$D, D124) + COUNTIF(Event24!$D:$D, D124) + COUNTIF(Event25!$D:$D, D124) + 0","v":3},{"$f":"IF(D124=\"\", \"\", IF(IFERROR(VLOOKUP(D124, Dues!D:D, 1, FALSE), \"\")=\"\", \"No\", \"Yes\"))","v":"No"},{"$f":"IF(D124=\"\", \"\", IF(IFERROR(VLOOKUP(D124, Interview!D:D, 1, FALSE), \"\")<>\"\", \"Yes\", IF(OR(C124=\"Fr\", C124=\"So\", AND(C124=\"Sr\", TODAY()<43646)), \"N/A\", \"No\")))","v":"No"}]
["Ryan","Hannon","Sr","rjh5595",{"$f":"COUNTIF(Event1!$D:$D, D125) + COUNTIF(Event2!$D:$D, D125) + COUNTIF(Event3!$D:$D, D125) + COUNTIF(Event4!$D:$D, D125) + COUNTIF(Event5!$D:$D, D125) + COUNTIF(Event6!$D:$D, D125) + COUNTIF(Event7!$D:$D, D125) + COUNTIF(Event8!$D:$D, D125) + COUNTIF(Event9!$D:$D, D125) + COUNTIF(Event10!$D:$D, D125) + COUNTIF(Event11!$D:$D, D125) + COUNTIF(Event12!$D:$D, D125) + COUNTIF(Event13!$D:$D, D125) + COUNTIF(Event14!$D:$D, D125) + COUNTIF(Event15!$D:$D, D125) + COUNTIF(Event16!$D:$D, D125) + COUNTIF(Event17!$D:$D, D125) + COUNTIF(Event18!$D:$D, D125) + COUNTIF(Event19!$D:$D, D125) + COUNTIF(Event20!$D:$D, D125) + COUNTIF(Event21!$D:$D, D125) + COUNTIF(Event22!$D:$D, D125) + COUNTIF(Event23!$D:$D, D125) + COUNTIF(Event24!$D:$D, D125) + COUNTIF(Event25!$D:$D, D125) + 0","v":3},{"$f":"IF(D125=\"\", \"\", IF(IFERROR(VLOOKUP(D125, Dues!D:D, 1, FALSE), \"\")=\"\", \"No\", \"Yes\"))","v":"Yes"},{"$f":"IF(D125=\"\", \"\", IF(IFERROR(VLOOKUP(D125, Interview!D:D, 1, FALSE), \"\")<>\"\", \"Yes\", IF(OR(C125=\"Fr\", C125=\"So\", AND(C125=\"Sr\", TODAY()<43646)), \"N/A\", \"No\")))","v":"N/A"}]
["David","Wooditch","Jr","dmw5806",{"$f":"COUNTIF(Event1!$D:$D, D126) + COUNTIF(Event2!$D:$D, D126) + COUNTIF(Event3!$D:$D, D126) + COUNTIF(Event4!$D:$D, D126) + COUNTIF(Event5!$D:$D, D126) + COUNTIF(Event6!$D:$D, D126) + COUNTIF(Event7!$D:$D, D126) + COUNTIF(Event8!$D:$D, D126) + COUNTIF(Event9!$D:$D, D126) + COUNTIF(Event10!$D:$D, D126) + COUNTIF(Event11!$D:$D, D126) + COUNTIF(Event12!$D:$D, D126) + COUNTIF(Event13!$D:$D, D126) + COUNTIF(Event14!$D:$D, D126) + COUNTIF(Event15!$D:$D, D126) + COUNTIF(Event16!$D:$D, D126) + COUNTIF(Event17!$D:$D, D126) + COUNTIF(Event18!$D:$D, D126) + COUNTIF(Event19!$D:$D, D126) + COUNTIF(Event20!$D:$D, D126) + COUNTIF(Event21!$D:$D, D126) + COUNTIF(Event22!$D:$D, D126) + COUNTIF(Event23!$D:$D, D126) + COUNTIF(Event24!$D:$D, D126) + COUNTIF(Event25!$D:$D, D126) + 0","v":2},{"$f":"IF(D126=\"\", \"\", IF(IFERROR(VLOOKUP(D126, Dues!D:D, 1, FALSE), \"\")=\"\", \"No\", \"Yes\"))","v":"Yes"},{"$f":"IF(D126=\"\", \"\", IF(IFERROR(VLOOKUP(D126, Interview!D:D, 1, FALSE), \"\")<>\"\", \"Yes\", IF(OR(C126=\"Fr\", C126=\"So\", AND(C126=\"Sr\", TODAY()<43646)), \"N/A\", \"No\")))","v":"Yes"}]
["Colby","Aument","Fr","cga5095",{"$f":"COUNTIF(Event1!$D:$D, D127) + COUNTIF(Event2!$D:$D, D127) + COUNTIF(Event3!$D:$D, D127) + COUNTIF(Event4!$D:$D, D127) + COUNTIF(Event5!$D:$D, D127) + COUNTIF(Event6!$D:$D, D127) + COUNTIF(Event7!$D:$D, D127) + COUNTIF(Event8!$D:$D, D127) + COUNTIF(Event9!$D:$D, D127) + COUNTIF(Event10!$D:$D, D127) + COUNTIF(Event11!$D:$D, D127) + COUNTIF(Event12!$D:$D, D127) + COUNTIF(Event13!$D:$D, D127) + COUNTIF(Event14!$D:$D, D127) + COUNTIF(Event15!$D:$D, D127) + COUNTIF(Event16!$D:$D, D127) + COUNTIF(Event17!$D:$D, D127) + COUNTIF(Event18!$D:$D, D127) + COUNTIF(Event19!$D:$D, D127) + COUNTIF(Event20!$D:$D, D127) + COUNTIF(Event21!$D:$D, D127) + COUNTIF(Event22!$D:$D, D127) + COUNTIF(Event23!$D:$D, D127) + COUNTIF(Event24!$D:$D, D127) + COUNTIF(Event25!$D:$D, D127) + 0","v":2},{"$f":"IF(D127=\"\", \"\", IF(IFERROR(VLOOKUP(D127, Dues!D:D, 1, FALSE), \"\")=\"\", \"No\", \"Yes\"))","v":"Yes"},{"$f":"IF(D127=\"\", \"\", IF(IFERROR(VLOOKUP(D127, Interview!D:D, 1, FALSE), \"\")<>\"\", \"Yes\", IF(OR(C127=\"Fr\", C127=\"So\", AND(C127=\"Sr\", TODAY()<43646)), \"N/A\", \"No\")))","v":"N/A"}]
["Ian","Kwon","So","kxk5556",{"$f":"COUNTIF(Event1!$D:$D, D128) + COUNTIF(Event2!$D:$D, D128) + COUNTIF(Event3!$D:$D, D128) + COUNTIF(Event4!$D:$D, D128) + COUNTIF(Event5!$D:$D, D128) + COUNTIF(Event6!$D:$D, D128) + COUNTIF(Event7!$D:$D, D128) + COUNTIF(Event8!$D:$D, D128) + COUNTIF(Event9!$D:$D, D128) + COUNTIF(Event10!$D:$D, D128) + COUNTIF(Event11!$D:$D, D128) + COUNTIF(Event12!$D:$D, D128) + COUNTIF(Event13!$D:$D, D128) + COUNTIF(Event14!$D:$D, D128) + COUNTIF(Event15!$D:$D, D128) + COUNTIF(Event16!$D:$D, D128) + COUNTIF(Event17!$D:$D, D128) + COUNTIF(Event18!$D:$D, D128) + COUNTIF(Event19!$D:$D, D128) + COUNTIF(Event20!$D:$D, D128) + COUNTIF(Event21!$D:$D, D128) + COUNTIF(Event22!$D:$D, D128) + COUNTIF(Event23!$D:$D, D128) + COUNTIF(Event24!$D:$D, D128) + COUNTIF(Event25!$D:$D, D128) + 0","v":2},{"$f":"IF(D128=\"\", \"\", IF(IFERROR(VLOOKUP(D128, Dues!D:D, 1, FALSE), \"\")=\"\", \"No\", \"Yes\"))","v":"No"},{"$f":"IF(D128=\"\", \"\", IF(IFERROR(VLOOKUP(D128, Interview!D:D, 1, FALSE), \"\")<>\"\", \"Yes\", IF(OR(C128=\"Fr\", C128=\"So\", AND(C128=\"Sr\", TODAY()<43646)), \"N/A\", \"No\")))","v":"N/A"}]
["Joseph","Kaverman","So","jmk6605",{"$f":"COUNTIF(Event1!$D:$D, D129) + COUNTIF(Event2!$D:$D, D129) + COUNTIF(Event3!$D:$D, D129) + COUNTIF(Event4!$D:$D, D129) + COUNTIF(Event5!$D:$D, D129) + COUNTIF(Event6!$D:$D, D129) + COUNTIF(Event7!$D:$D, D129) + COUNTIF(Event8!$D:$D, D129) + COUNTIF(Event9!$D:$D, D129) + COUNTIF(Event10!$D:$D, D129) + COUNTIF(Event11!$D:$D, D129) + COUNTIF(Event12!$D:$D, D129) + COUNTIF(Event13!$D:$D, D129) + COUNTIF(Event14!$D:$D, D129) + COUNTIF(Event15!$D:$D, D129) + COUNTIF(Event16!$D:$D, D129) + COUNTIF(Event17!$D:$D, D129) + COUNTIF(Event18!$D:$D, D129) + COUNTIF(Event19!$D:$D, D129) + COUNTIF(Event20!$D:$D, D129) + COUNTIF(Event21!$D:$D, D129) + COUNTIF(Event22!$D:$D, D129) + COUNTIF(Event23!$D:$D, D129) + COUNTIF(Event24!$D:$D, D129) + COUNTIF(Event25!$D:$D, D129) + 0","v":2},{"$f":"IF(D129=\"\", \"\", IF(IFERROR(VLOOKUP(D129, Dues!D:D, 1, FALSE), \"\")=\"\", \"No\", \"Yes\"))","v":"Yes"},{"$f":"IF(D129=\"\", \"\", IF(IFERROR(VLOOKUP(D129, Interview!D:D, 1, FALSE), \"\")<>\"\", \"Yes\", IF(OR(C129=\"Fr\", C129=\"So\", AND(C129=\"Sr\", TODAY()<43646)), \"N/A\", \"No\")))","v":"N/A"}]
["Thomas","Piccari","Sr","tvp5216",{"$f":"COUNTIF(Event1!$D:$D, D130) + COUNTIF(Event2!$D:$D, D130) + COUNTIF(Event3!$D:$D, D130) + COUNTIF(Event4!$D:$D, D130) + COUNTIF(Event5!$D:$D, D130) + COUNTIF(Event6!$D:$D, D130) + COUNTIF(Event7!$D:$D, D130) + COUNTIF(Event8!$D:$D, D130) + COUNTIF(Event9!$D:$D, D130) + COUNTIF(Event10!$D:$D, D130) + COUNTIF(Event11!$D:$D, D130) + COUNTIF(Event12!$D:$D, D130) + COUNTIF(Event13!$D:$D, D130) + COUNTIF(Event14!$D:$D, D130) + COUNTIF(Event15!$D:$D, D130) + COUNTIF(Event16!$D:$D, D130) + COUNTIF(Event17!$D:$D, D130) + COUNTIF(Event18!$D:$D, D130) + COUNTIF(Event19!$D:$D, D130) + COUNTIF(Event20!$D:$D, D130) + COUNTIF(Event21!$D:$D, D130) + COUNTIF(Event22!$D:$D, D130) + COUNTIF(Event23!$D:$D, D130) + COUNTIF(Event24!$D:$D, D130) + COUNTIF(Event25!$D:$D, D130) + 0","v":2},{"$f":"IF(D130=\"\", \"\", IF(IFERROR(VLOOKUP(D130, Dues!D:D, 1, FALSE), \"\")=\"\", \"No\", \"Yes\"))","v":"Yes"},{"$f":"IF(D130=\"\", \"\", IF(IFERROR(VLOOKUP(D130, Interview!D:D, 1, FALSE), \"\")<>\"\", \"Yes\", IF(OR(C130=\"Fr\", C130=\"So\", AND(C130=\"Sr\", TODAY()<43646)), \"N/A\", \"No\")))","v":"N/A"}]
["Ryan","Pityk","So","rxp5323",{"$f":"COUNTIF(Event1!$D:$D, D131) + COUNTIF(Event2!$D:$D, D131) + COUNTIF(Event3!$D:$D, D131) + COUNTIF(Event4!$D:$D, D131) + COUNTIF(Event5!$D:$D, D131) + COUNTIF(Event6!$D:$D, D131) + COUNTIF(Event7!$D:$D, D131) + COUNTIF(Event8!$D:$D, D131) + COUNTIF(Event9!$D:$D, D131) + COUNTIF(Event10!$D:$D, D131) + COUNTIF(Event11!$D:$D, D131) + COUNTIF(Event12!$D:$D, D131) + COUNTIF(Event13!$D:$D, D131) + COUNTIF(Event14!$D:$D, D131) + COUNTIF(Event15!$D:$D, D131) + COUNTIF(Event16!$D:$D, D131) + COUNTIF(Event17!$D:$D, D131) + COUNTIF(Event18!$D:$D, D131) + COUNTIF(Event19!$D:$D, D131) + COUNTIF(Event20!$D:$D, D131) + COUNTIF(Event21!$D:$D, D131) + COUNTIF(Event22!$D:$D, D131) + COUNTIF(Event23!$D:$D, D131) + COUNTIF(Event24!$D:$D, D131) + COUNTIF(Event25!$D:$D, D131) + 0","v":2},{"$f":"IF(D131=\"\", \"\", IF(IFERROR(VLOOKUP(D131, Dues!D:D, 1, FALSE), \"\")=\"\", \"No\", \"Yes\"))","v":"Yes"},{"$f":"IF(D131=\"\", \"\", IF(IFERROR(VLOOKUP(D131, Interview!D:D, 1, FALSE), \"\")<>\"\", \"Yes\", IF(OR(C131=\"Fr\", C131=\"So\", AND(C131=\"Sr\", TODAY()<43646)), \"N/A\", \"No\")))","v":"N/A"}]
["Maria","Howe","Fr","mrh64",{"$f":"COUNTIF(Event1!$D:$D, D132) + COUNTIF(Event2!$D:$D, D132) + COUNTIF(Event3!$D:$D, D132) + COUNTIF(Event4!$D:$D, D132) + COUNTIF(Event5!$D:$D, D132) + COUNTIF(Event6!$D:$D, D132) + COUNTIF(Event7!$D:$D, D132) + COUNTIF(Event8!$D:$D, D132) + COUNTIF(Event9!$D:$D, D132) + COUNTIF(Event10!$D:$D, D132) + COUNTIF(Event11!$D:$D, D132) + COUNTIF(Event12!$D:$D, D132) + COUNTIF(Event13!$D:$D, D132) + COUNTIF(Event14!$D:$D, D132) + COUNTIF(Event15!$D:$D, D132) + COUNTIF(Event16!$D:$D, D132) + COUNTIF(Event17!$D:$D, D132) + COUNTIF(Event18!$D:$D, D132) + COUNTIF(Event19!$D:$D, D132) + COUNTIF(Event20!$D:$D, D132) + COUNTIF(Event21!$D:$D, D132) + COUNTIF(Event22!$D:$D, D132) + COUNTIF(Event23!$D:$D, D132) + COUNTIF(Event24!$D:$D, D132) + COUNTIF(Event25!$D:$D, D132) + 0","v":2},{"$f":"IF(D132=\"\", \"\", IF(IFERROR(VLOOKUP(D132, Dues!D:D, 1, FALSE), \"\")=\"\", \"No\", \"Yes\"))","v":"Yes"},{"$f":"IF(D132=\"\", \"\", IF(IFERROR(VLOOKUP(D132, Interview!D:D, 1, FALSE), \"\")<>\"\", \"Yes\", IF(OR(C132=\"Fr\", C132=\"So\", AND(C132=\"Sr\", TODAY()<43646)), \"N/A\", \"No\")))","v":"N/A"}]
["Zhiyang","Liang","Fr","zfl5166",{"$f":"COUNTIF(Event1!$D:$D, D133) + COUNTIF(Event2!$D:$D, D133) + COUNTIF(Event3!$D:$D, D133) + COUNTIF(Event4!$D:$D, D133) + COUNTIF(Event5!$D:$D, D133) + COUNTIF(Event6!$D:$D, D133) + COUNTIF(Event7!$D:$D, D133) + COUNTIF(Event8!$D:$D, D133) + COUNTIF(Event9!$D:$D, D133) + COUNTIF(Event10!$D:$D, D133) + COUNTIF(Event11!$D:$D, D133) + COUNTIF(Event12!$D:$D, D133) + COUNTIF(Event13!$D:$D, D133) + COUNTIF(Event14!$D:$D, D133) + COUNTIF(Event15!$D:$D, D133) + COUNTIF(Event16!$D:$D, D133) + COUNTIF(Event17!$D:$D, D133) + COUNTIF(Event18!$D:$D, D133) + COUNTIF(Event19!$D:$D, D133) + COUNTIF(Event20!$D:$D, D133) + COUNTIF(Event21!$D:$D, D133) + COUNTIF(Event22!$D:$D, D133) + COUNTIF(Event23!$D:$D, D133) + COUNTIF(Event24!$D:$D, D133) + COUNTIF(Event25!$D:$D, D133) + 0","v":2},{"$f":"IF(D133=\"\", \"\", IF(IFERROR(VLOOKUP(D133, Dues!D:D, 1, FALSE), \"\")=\"\", \"No\", \"Yes\"))","v":"Yes"},{"$f":"IF(D133=\"\", \"\", IF(IFERROR(VLOOKUP(D133, Interview!D:D, 1, FALSE), \"\")<>\"\", \"Yes\", IF(OR(C133=\"Fr\", C133=\"So\", AND(C133=\"Sr\", TODAY()<43646)), \"N/A\", \"No\")))","v":"N/A"}]
["Taylor","Geppert","Fr","stg5184",{"$f":"COUNTIF(Event1!$D:$D, D134) + COUNTIF(Event2!$D:$D, D134) + COUNTIF(Event3!$D:$D, D134) + COUNTIF(Event4!$D:$D, D134) + COUNTIF(Event5!$D:$D, D134) + COUNTIF(Event6!$D:$D, D134) + COUNTIF(Event7!$D:$D, D134) + COUNTIF(Event8!$D:$D, D134) + COUNTIF(Event9!$D:$D, D134) + COUNTIF(Event10!$D:$D, D134) + COUNTIF(Event11!$D:$D, D134) + COUNTIF(Event12!$D:$D, D134) + COUNTIF(Event13!$D:$D, D134) + COUNTIF(Event14!$D:$D, D134) + COUNTIF(Event15!$D:$D, D134) + COUNTIF(Event16!$D:$D, D134) + COUNTIF(Event17!$D:$D, D134) + COUNTIF(Event18!$D:$D, D134) + COUNTIF(Event19!$D:$D, D134) + COUNTIF(Event20!$D:$D, D134) + COUNTIF(Event21!$D:$D, D134) + COUNTIF(Event22!$D:$D, D134) + COUNTIF(Event23!$D:$D, D134) + COUNTIF(Event24!$D:$D, D134) + COUNTIF(Event25!$D:$D, D134) + 0","v":2},{"$f":"IF(D134=\"\", \"\", IF(IFERROR(VLOOKUP(D134, Dues!D:D, 1, FALSE), \"\")=\"\", \"No\", \"Yes\"))","v":"Yes"},{"$f":"IF(D134=\"\", \"\", IF(IFERROR(VLOOKUP(D134, Interview!D:D, 1, FALSE), \"\")<>\"\", \"Yes\", IF(OR(C134=\"Fr\", C134=\"So\", AND(C134=\"Sr\", TODAY()<43646)), \"N/A\", \"No\")))","v":"N/A"}]
["Chris","Scalies","Fr","cjs6819",{"$f":"COUNTIF(Event1!$D:$D, D135) + COUNTIF(Event2!$D:$D, D135) + COUNTIF(Event3!$D:$D, D135) + COUNTIF(Event4!$D:$D, D135) + COUNTIF(Event5!$D:$D, D135) + COUNTIF(Event6!$D:$D, D135) + COUNTIF(Event7!$D:$D, D135) + COUNTIF(Event8!$D:$D, D135) + COUNTIF(Event9!$D:$D, D135) + COUNTIF(Event10!$D:$D, D135) + COUNTIF(Event11!$D:$D, D135) + COUNTIF(Event12!$D:$D, D135) + COUNTIF(Event13!$D:$D, D135) + COUNTIF(Event14!$D:$D, D135) + COUNTIF(Event15!$D:$D, D135) + COUNTIF(Event16!$D:$D, D135) + COUNTIF(Event17!$D:$D, D135) + COUNTIF(Event18!$D:$D, D135) + COUNTIF(Event19!$D:$D, D135) + COUNTIF(Event20!$D:$D, D135) + COUNTIF(Event21!$D:$D, D135) + COUNTIF(Event22!$D:$D, D135) + COUNTIF(Event23!$D:$D, D135) + COUNTIF(Event24!$D:$D, D135) + COUNTIF(Event25!$D:$D, D135) + 0","v":2},{"$f":"IF(D135=\"\", \"\", IF(IFERROR(VLOOKUP(D135, Dues!D:D, 1, FALSE), \"\")=\"\", \"No\", \"Yes\"))","v":"Yes"},{"$f":"IF(D135=\"\", \"\", IF(IFERROR(VLOOKUP(D135, Interview!D:D, 1, FALSE), \"\")<>\"\", \"Yes\", IF(OR(C135=\"Fr\", C135=\"So\", AND(C135=\"Sr\", TODAY()<43646)), \"N/A\", \"No\")))","v":"N/A"}]
["Kari","Huth","Sr","kvh5221",{"$f":"COUNTIF(Event1!$D:$D, D136) + COUNTIF(Event2!$D:$D, D136) + COUNTIF(Event3!$D:$D, D136) + COUNTIF(Event4!$D:$D, D136) + COUNTIF(Event5!$D:$D, D136) + COUNTIF(Event6!$D:$D, D136) + COUNTIF(Event7!$D:$D, D136) + COUNTIF(Event8!$D:$D, D136) + COUNTIF(Event9!$D:$D, D136) + COUNTIF(Event10!$D:$D, D136) + COUNTIF(Event11!$D:$D, D136) + COUNTIF(Event12!$D:$D, D136) + COUNTIF(Event13!$D:$D, D136) + COUNTIF(Event14!$D:$D, D136) + COUNTIF(Event15!$D:$D, D136) + COUNTIF(Event16!$D:$D, D136) + COUNTIF(Event17!$D:$D, D136) + COUNTIF(Event18!$D:$D, D136) + COUNTIF(Event19!$D:$D, D136) + COUNTIF(Event20!$D:$D, D136) + COUNTIF(Event21!$D:$D, D136) + COUNTIF(Event22!$D:$D, D136) + COUNTIF(Event23!$D:$D, D136) + COUNTIF(Event24!$D:$D, D136) + COUNTIF(Event25!$D:$D, D136) + 0","v":2},{"$f":"IF(D136=\"\", \"\", IF(IFERROR(VLOOKUP(D136, Dues!D:D, 1, FALSE), \"\")=\"\", \"No\", \"Yes\"))","v":"Yes"},{"$f":"IF(D136=\"\", \"\", IF(IFERROR(VLOOKUP(D136, Interview!D:D, 1, FALSE), \"\")<>\"\", \"Yes\", IF(OR(C136=\"Fr\", C136=\"So\", AND(C136=\"Sr\", TODAY()<43646)), \"N/A\", \"No\")))","v":"N/A"}]
["siamio","dong","Fr","sqd5576",{"$f":"COUNTIF(Event1!$D:$D, D137) + COUNTIF(Event2!$D:$D, D137) + COUNTIF(Event3!$D:$D, D137) + COUNTIF(Event4!$D:$D, D137) + COUNTIF(Event5!$D:$D, D137) + COUNTIF(Event6!$D:$D, D137) + COUNTIF(Event7!$D:$D, D137) + COUNTIF(Event8!$D:$D, D137) + COUNTIF(Event9!$D:$D, D137) + COUNTIF(Event10!$D:$D, D137) + COUNTIF(Event11!$D:$D, D137) + COUNTIF(Event12!$D:$D, D137) + COUNTIF(Event13!$D:$D, D137) + COUNTIF(Event14!$D:$D, D137) + COUNTIF(Event15!$D:$D, D137) + COUNTIF(Event16!$D:$D, D137) + COUNTIF(Event17!$D:$D, D137) + COUNTIF(Event18!$D:$D, D137) + COUNTIF(Event19!$D:$D, D137) + COUNTIF(Event20!$D:$D, D137) + COUNTIF(Event21!$D:$D, D137) + COUNTIF(Event22!$D:$D, D137) + COUNTIF(Event23!$D:$D, D137) + COUNTIF(Event24!$D:$D, D137) + COUNTIF(Event25!$D:$D, D137) + 0","v":2},{"$f":"IF(D137=\"\", \"\", IF(IFERROR(VLOOKUP(D137, Dues!D:D, 1, FALSE), \"\")=\"\", \"No\", \"Yes\"))","v":"No"},{"$f":"IF(D137=\"\", \"\", IF(IFERROR(VLOOKUP(D137, Interview!D:D, 1, FALSE), \"\")<>\"\", \"Yes\", IF(OR(C137=\"Fr\", C137=\"So\", AND(C137=\"Sr\", TODAY()<43646)), \"N/A\", \"No\")))","v":"N/A"}]
["Jake","Wagner","Fr","jfw5541",{"$f":"COUNTIF(Event1!$D:$D, D138) + COUNTIF(Event2!$D:$D, D138) + COUNTIF(Event3!$D:$D, D138) + COUNTIF(Event4!$D:$D, D138) + COUNTIF(Event5!$D:$D, D138) + COUNTIF(Event6!$D:$D, D138) + COUNTIF(Event7!$D:$D, D138) + COUNTIF(Event8!$D:$D, D138) + COUNTIF(Event9!$D:$D, D138) + COUNTIF(Event10!$D:$D, D138) + COUNTIF(Event11!$D:$D, D138) + COUNTIF(Event12!$D:$D, D138) + COUNTIF(Event13!$D:$D, D138) + COUNTIF(Event14!$D:$D, D138) + COUNTIF(Event15!$D:$D, D138) + COUNTIF(Event16!$D:$D, D138) + COUNTIF(Event17!$D:$D, D138) + COUNTIF(Event18!$D:$D, D138) + COUNTIF(Event19!$D:$D, D138) + COUNTIF(Event20!$D:$D, D138) + COUNTIF(Event21!$D:$D, D138) + COUNTIF(Event22!$D:$D, D138) + COUNTIF(Event23!$D:$D, D138) + COUNTIF(Event24!$D:$D, D138) + COUNTIF(Event25!$D:$D, D138) + 0","v":2},{"$f":"IF(D138=\"\", \"\", IF(IFERROR(VLOOKUP(D138, Dues!D:D, 1, FALSE), \"\")=\"\", \"No\", \"Yes\"))","v":"Yes"},{"$f":"IF(D138=\"\", \"\", IF(IFERROR(VLOOKUP(D138, Interview!D:D, 1, FALSE), \"\")<>\"\", \"Yes\", IF(OR(C138=\"Fr\", C138=\"So\", AND(C138=\"Sr\", TODAY()<43646)), \"N/A\", \"No\")))","v":"N/A"}]
["Mingyin","Xie","So","mvx5050",{"$f":"COUNTIF(Event1!$D:$D, D139) + COUNTIF(Event2!$D:$D, D139) + COUNTIF(Event3!$D:$D, D139) + COUNTIF(Event4!$D:$D, D139) + COUNTIF(Event5!$D:$D, D139) + COUNTIF(Event6!$D:$D, D139) + COUNTIF(Event7!$D:$D, D139) + COUNTIF(Event8!$D:$D, D139) + COUNTIF(Event9!$D:$D, D139) + COUNTIF(Event10!$D:$D, D139) + COUNTIF(Event11!$D:$D, D139) + COUNTIF(Event12!$D:$D, D139) + COUNTIF(Event13!$D:$D, D139) + COUNTIF(Event14!$D:$D, D139) + COUNTIF(Event15!$D:$D, D139) + COUNTIF(Event16!$D:$D, D139) + COUNTIF(Event17!$D:$D, D139) + COUNTIF(Event18!$D:$D, D139) + COUNTIF(Event19!$D:$D, D139) + COUNTIF(Event20!$D:$D, D139) + COUNTIF(Event21!$D:$D, D139) + COUNTIF(Event22!$D:$D, D139) + COUNTIF(Event23!$D:$D, D139) + COUNTIF(Event24!$D:$D, D139) + COUNTIF(Event25!$D:$D, D139) + 0","v":2},{"$f":"IF(D139=\"\", \"\", IF(IFERROR(VLOOKUP(D139, Dues!D:D, 1, FALSE), \"\")=\"\", \"No\", \"Yes\"))","v":"Yes"},{"$f":"IF(D139=\"\", \"\", IF(IFERROR(VLOOKUP(D139, Interview!D:D, 1, FALSE), \"\")<>\"\", \"Yes\", IF(OR(C139=\"Fr\", C139=\"So\", AND(C139=\"Sr\", TODAY()<43646)), \"N/A\", \"No\")))","v":"N/A"}]
["Longhao","Yang","So","lky5069",{"$f":"COUNTIF(Event1!$D:$D, D140) + COUNTIF(Event2!$D:$D, D140) + COUNTIF(Event3!$D:$D, D140) + COUNTIF(Event4!$D:$D, D140) + COUNTIF(Event5!$D:$D, D140) + COUNTIF(Event6!$D:$D, D140) + COUNTIF(Event7!$D:$D, D140) + COUNTIF(Event8!$D:$D, D140) + COUNTIF(Event9!$D:$D, D140) + COUNTIF(Event10!$D:$D, D140) + COUNTIF(Event11!$D:$D, D140) + COUNTIF(Event12!$D:$D, D140) + COUNTIF(Event13!$D:$D, D140) + COUNTIF(Event14!$D:$D, D140) + COUNTIF(Event15!$D:$D, D140) + COUNTIF(Event16!$D:$D, D140) + COUNTIF(Event17!$D:$D, D140) + COUNTIF(Event18!$D:$D, D140) + COUNTIF(Event19!$D:$D, D140) + COUNTIF(Event20!$D:$D, D140) + COUNTIF(Event21!$D:$D, D140) + COUNTIF(Event22!$D:$D, D140) + COUNTIF(Event23!$D:$D, D140) + COUNTIF(Event24!$D:$D, D140) + COUNTIF(Event25!$D:$D, D140) + 0","v":2},{"$f":"IF(D140=\"\", \"\", IF(IFERROR(VLOOKUP(D140, Dues!D:D, 1, FALSE), \"\")=\"\", \"No\", \"Yes\"))","v":"Yes"},{"$f":"IF(D140=\"\", \"\", IF(IFERROR(VLOOKUP(D140, Interview!D:D, 1, FALSE), \"\")<>\"\", \"Yes\", IF(OR(C140=\"Fr\", C140=\"So\", AND(C140=\"Sr\", TODAY()<43646)), \"N/A\", \"No\")))","v":"N/A"}]
["Mitch","Detwiler","So","mxd5561",{"$f":"COUNTIF(Event1!$D:$D, D141) + COUNTIF(Event2!$D:$D, D141) + COUNTIF(Event3!$D:$D, D141) + COUNTIF(Event4!$D:$D, D141) + COUNTIF(Event5!$D:$D, D141) + COUNTIF(Event6!$D:$D, D141) + COUNTIF(Event7!$D:$D, D141) + COUNTIF(Event8!$D:$D, D141) + COUNTIF(Event9!$D:$D, D141) + COUNTIF(Event10!$D:$D, D141) + COUNTIF(Event11!$D:$D, D141) + COUNTIF(Event12!$D:$D, D141) + COUNTIF(Event13!$D:$D, D141) + COUNTIF(Event14!$D:$D, D141) + COUNTIF(Event15!$D:$D, D141) + COUNTIF(Event16!$D:$D, D141) + COUNTIF(Event17!$D:$D, D141) + COUNTIF(Event18!$D:$D, D141) + COUNTIF(Event19!$D:$D, D141) + COUNTIF(Event20!$D:$D, D141) + COUNTIF(Event21!$D:$D, D141) + COUNTIF(Event22!$D:$D, D141) + COUNTIF(Event23!$D:$D, D141) + COUNTIF(Event24!$D:$D, D141) + COUNTIF(Event25!$D:$D, D141) + 0","v":2},{"$f":"IF(D141=\"\", \"\", IF(IFERROR(VLOOKUP(D141, Dues!D:D, 1, FALSE), \"\")=\"\", \"No\", \"Yes\"))","v":"Yes"},{"$f":"IF(D141=\"\", \"\", IF(IFERROR(VLOOKUP(D141, Interview!D:D, 1, FALSE), \"\")<>\"\", \"Yes\", IF(OR(C141=\"Fr\", C141=\"So\", AND(C141=\"Sr\", TODAY()<43646)), \"N/A\", \"No\")))","v":"N/A"}]
["Hanlin","Zhang","Fr","hbz5102",{"$f":"COUNTIF(Event1!$D:$D, D142) + COUNTIF(Event2!$D:$D, D142) + COUNTIF(Event3!$D:$D, D142) + COUNTIF(Event4!$D:$D, D142) + COUNTIF(Event5!$D:$D, D142) + COUNTIF(Event6!$D:$D, D142) + COUNTIF(Event7!$D:$D, D142) + COUNTIF(Event8!$D:$D, D142) + COUNTIF(Event9!$D:$D, D142) + COUNTIF(Event10!$D:$D, D142) + COUNTIF(Event11!$D:$D, D142) + COUNTIF(Event12!$D:$D, D142) + COUNTIF(Event13!$D:$D, D142) + COUNTIF(Event14!$D:$D, D142) + COUNTIF(Event15!$D:$D, D142) + COUNTIF(Event16!$D:$D, D142) + COUNTIF(Event17!$D:$D, D142) + COUNTIF(Event18!$D:$D, D142) + COUNTIF(Event19!$D:$D, D142) + COUNTIF(Event20!$D:$D, D142) + COUNTIF(Event21!$D:$D, D142) + COUNTIF(Event22!$D:$D, D142) + COUNTIF(Event23!$D:$D, D142) + COUNTIF(Event24!$D:$D, D142) + COUNTIF(Event25!$D:$D, D142) + 0","v":2},{"$f":"IF(D142=\"\", \"\", IF(IFERROR(VLOOKUP(D142, Dues!D:D, 1, FALSE), \"\")=\"\", \"No\", \"Yes\"))","v":"Yes"},{"$f":"IF(D142=\"\", \"\", IF(IFERROR(VLOOKUP(D142, Interview!D:D, 1, FALSE), \"\")<>\"\", \"Yes\", IF(OR(C142=\"Fr\", C142=\"So\", AND(C142=\"Sr\", TODAY()<43646)), \"N/A\", \"No\")))","v":"N/A"}]
["Haobo","Fan","Fr","hmf5251",{"$f":"COUNTIF(Event1!$D:$D, D143) + COUNTIF(Event2!$D:$D, D143) + COUNTIF(Event3!$D:$D, D143) + COUNTIF(Event4!$D:$D, D143) + COUNTIF(Event5!$D:$D, D143) + COUNTIF(Event6!$D:$D, D143) + COUNTIF(Event7!$D:$D, D143) + COUNTIF(Event8!$D:$D, D143) + COUNTIF(Event9!$D:$D, D143) + COUNTIF(Event10!$D:$D, D143) + COUNTIF(Event11!$D:$D, D143) + COUNTIF(Event12!$D:$D, D143) + COUNTIF(Event13!$D:$D, D143) + COUNTIF(Event14!$D:$D, D143) + COUNTIF(Event15!$D:$D, D143) + COUNTIF(Event16!$D:$D, D143) + COUNTIF(Event17!$D:$D, D143) + COUNTIF(Event18!$D:$D, D143) + COUNTIF(Event19!$D:$D, D143) + COUNTIF(Event20!$D:$D, D143) + COUNTIF(Event21!$D:$D, D143) + COUNTIF(Event22!$D:$D, D143) + COUNTIF(Event23!$D:$D, D143) + COUNTIF(Event24!$D:$D, D143) + COUNTIF(Event25!$D:$D, D143) + 0","v":2},{"$f":"IF(D143=\"\", \"\", IF(IFERROR(VLOOKUP(D143, Dues!D:D, 1, FALSE), \"\")=\"\", \"No\", \"Yes\"))","v":"Yes"},{"$f":"IF(D143=\"\", \"\", IF(IFERROR(VLOOKUP(D143, Interview!D:D, 1, FALSE), \"\")<>\"\", \"Yes\", IF(OR(C143=\"Fr\", C143=\"So\", AND(C143=\"Sr\", TODAY()<43646)), \"N/A\", \"No\")))","v":"N/A"}]
["Kabir ","Kohli","Jr","kxk338",{"$f":"COUNTIF(Event1!$D:$D, D144) + COUNTIF(Event2!$D:$D, D144) + COUNTIF(Event3!$D:$D, D144) + COUNTIF(Event4!$D:$D, D144) + COUNTIF(Event5!$D:$D, D144) + COUNTIF(Event6!$D:$D, D144) + COUNTIF(Event7!$D:$D, D144) + COUNTIF(Event8!$D:$D, D144) + COUNTIF(Event9!$D:$D, D144) + COUNTIF(Event10!$D:$D, D144) + COUNTIF(Event11!$D:$D, D144) + COUNTIF(Event12!$D:$D, D144) + COUNTIF(Event13!$D:$D, D144) + COUNTIF(Event14!$D:$D, D144) + COUNTIF(Event15!$D:$D, D144) + COUNTIF(Event16!$D:$D, D144) + COUNTIF(Event17!$D:$D, D144) + COUNTIF(Event18!$D:$D, D144) + COUNTIF(Event19!$D:$D, D144) + COUNTIF(Event20!$D:$D, D144) + COUNTIF(Event21!$D:$D, D144) + COUNTIF(Event22!$D:$D, D144) + COUNTIF(Event23!$D:$D, D144) + COUNTIF(Event24!$D:$D, D144) + COUNTIF(Event25!$D:$D, D144) + 0","v":2},{"$f":"IF(D144=\"\", \"\", IF(IFERROR(VLOOKUP(D144, Dues!D:D, 1, FALSE), \"\")=\"\", \"No\", \"Yes\"))","v":"Yes"},{"$f":"IF(D144=\"\", \"\", IF(IFERROR(VLOOKUP(D144, Interview!D:D, 1, FALSE), \"\")<>\"\", \"Yes\", IF(OR(C144=\"Fr\", C144=\"So\", AND(C144=\"Sr\", TODAY()<43646)), \"N/A\", \"No\")))","v":"No"}]
["Matt ","McClintick","Fr","mjm7869",{"$f":"COUNTIF(Event1!$D:$D, D145) + COUNTIF(Event2!$D:$D, D145) + COUNTIF(Event3!$D:$D, D145) + COUNTIF(Event4!$D:$D, D145) + COUNTIF(Event5!$D:$D, D145) + COUNTIF(Event6!$D:$D, D145) + COUNTIF(Event7!$D:$D, D145) + COUNTIF(Event8!$D:$D, D145) + COUNTIF(Event9!$D:$D, D145) + COUNTIF(Event10!$D:$D, D145) + COUNTIF(Event11!$D:$D, D145) + COUNTIF(Event12!$D:$D, D145) + COUNTIF(Event13!$D:$D, D145) + COUNTIF(Event14!$D:$D, D145) + COUNTIF(Event15!$D:$D, D145) + COUNTIF(Event16!$D:$D, D145) + COUNTIF(Event17!$D:$D, D145) + COUNTIF(Event18!$D:$D, D145) + COUNTIF(Event19!$D:$D, D145) + COUNTIF(Event20!$D:$D, D145) + COUNTIF(Event21!$D:$D, D145) + COUNTIF(Event22!$D:$D, D145) + COUNTIF(Event23!$D:$D, D145) + COUNTIF(Event24!$D:$D, D145) + COUNTIF(Event25!$D:$D, D145) + 0","v":2},{"$f":"IF(D145=\"\", \"\", IF(IFERROR(VLOOKUP(D145, Dues!D:D, 1, FALSE), \"\")=\"\", \"No\", \"Yes\"))","v":"Yes"},{"$f":"IF(D145=\"\", \"\", IF(IFERROR(VLOOKUP(D145, Interview!D:D, 1, FALSE), \"\")<>\"\", \"Yes\", IF(OR(C145=\"Fr\", C145=\"So\", AND(C145=\"Sr\", TODAY()<43646)), \"N/A\", \"No\")))","v":"N/A"}]
["Maya","DiGirolamo","Fr","mvd5783",{"$f":"COUNTIF(Event1!$D:$D, D146) + COUNTIF(Event2!$D:$D, D146) + COUNTIF(Event3!$D:$D, D146) + COUNTIF(Event4!$D:$D, D146) + COUNTIF(Event5!$D:$D, D146) + COUNTIF(Event6!$D:$D, D146) + COUNTIF(Event7!$D:$D, D146) + COUNTIF(Event8!$D:$D, D146) + COUNTIF(Event9!$D:$D, D146) + COUNTIF(Event10!$D:$D, D146) + COUNTIF(Event11!$D:$D, D146) + COUNTIF(Event12!$D:$D, D146) + COUNTIF(Event13!$D:$D, D146) + COUNTIF(Event14!$D:$D, D146) + COUNTIF(Event15!$D:$D, D146) + COUNTIF(Event16!$D:$D, D146) + COUNTIF(Event17!$D:$D, D146) + COUNTIF(Event18!$D:$D, D146) + COUNTIF(Event19!$D:$D, D146) + COUNTIF(Event20!$D:$D, D146) + COUNTIF(Event21!$D:$D, D146) + COUNTIF(Event22!$D:$D, D146) + COUNTIF(Event23!$D:$D, D146) + COUNTIF(Event24!$D:$D, D146) + COUNTIF(Event25!$D:$D, D146) + 0","v":2},{"$f":"IF(D146=\"\", \"\", IF(IFERROR(VLOOKUP(D146, Dues!D:D, 1, FALSE), \"\")=\"\", \"No\", \"Yes\"))","v":"Yes"},{"$f":"IF(D146=\"\", \"\", IF(IFERROR(VLOOKUP(D146, Interview!D:D, 1, FALSE), \"\")<>\"\", \"Yes\", IF(OR(C146=\"Fr\", C146=\"So\", AND(C146=\"Sr\", TODAY()<43646)), \"N/A\", \"No\")))","v":"N/A"}]
["Eric ","Zi","Fr","gzz5074",{"$f":"COUNTIF(Event1!$D:$D, D147) + COUNTIF(Event2!$D:$D, D147) + COUNTIF(Event3!$D:$D, D147) + COUNTIF(Event4!$D:$D, D147) + COUNTIF(Event5!$D:$D, D147) + COUNTIF(Event6!$D:$D, D147) + COUNTIF(Event7!$D:$D, D147) + COUNTIF(Event8!$D:$D, D147) + COUNTIF(Event9!$D:$D, D147) + COUNTIF(Event10!$D:$D, D147) + COUNTIF(Event11!$D:$D, D147) + COUNTIF(Event12!$D:$D, D147) + COUNTIF(Event13!$D:$D, D147) + COUNTIF(Event14!$D:$D, D147) + COUNTIF(Event15!$D:$D, D147) + COUNTIF(Event16!$D:$D, D147) + COUNTIF(Event17!$D:$D, D147) + COUNTIF(Event18!$D:$D, D147) + COUNTIF(Event19!$D:$D, D147) + COUNTIF(Event20!$D:$D, D147) + COUNTIF(Event21!$D:$D, D147) + COUNTIF(Event22!$D:$D, D147) + COUNTIF(Event23!$D:$D, D147) + COUNTIF(Event24!$D:$D, D147) + COUNTIF(Event25!$D:$D, D147) + 0","v":2},{"$f":"IF(D147=\"\", \"\", IF(IFERROR(VLOOKUP(D147, Dues!D:D, 1, FALSE), \"\")=\"\", \"No\", \"Yes\"))","v":"Yes"},{"$f":"IF(D147=\"\", \"\", IF(IFERROR(VLOOKUP(D147, Interview!D:D, 1, FALSE), \"\")<>\"\", \"Yes\", IF(OR(C147=\"Fr\", C147=\"So\", AND(C147=\"Sr\", TODAY()<43646)), \"N/A\", \"No\")))","v":"N/A"}]
["Qiaojuan","Tu","Fr ","qkt5010",{"$f":"COUNTIF(Event1!$D:$D, D148) + COUNTIF(Event2!$D:$D, D148) + COUNTIF(Event3!$D:$D, D148) + COUNTIF(Event4!$D:$D, D148) + COUNTIF(Event5!$D:$D, D148) + COUNTIF(Event6!$D:$D, D148) + COUNTIF(Event7!$D:$D, D148) + COUNTIF(Event8!$D:$D, D148) + COUNTIF(Event9!$D:$D, D148) + COUNTIF(Event10!$D:$D, D148) + COUNTIF(Event11!$D:$D, D148) + COUNTIF(Event12!$D:$D, D148) + COUNTIF(Event13!$D:$D, D148) + COUNTIF(Event14!$D:$D, D148) + COUNTIF(Event15!$D:$D, D148) + COUNTIF(Event16!$D:$D, D148) + COUNTIF(Event17!$D:$D, D148) + COUNTIF(Event18!$D:$D, D148) + COUNTIF(Event19!$D:$D, D148) + COUNTIF(Event20!$D:$D, D148) + COUNTIF(Event21!$D:$D, D148) + COUNTIF(Event22!$D:$D, D148) + COUNTIF(Event23!$D:$D, D148) + COUNTIF(Event24!$D:$D, D148) + COUNTIF(Event25!$D:$D, D148) + 0","v":2},{"$f":"IF(D148=\"\", \"\", IF(IFERROR(VLOOKUP(D148, Dues!D:D, 1, FALSE), \"\")=\"\", \"No\", \"Yes\"))","v":"Yes"},{"$f":"IF(D148=\"\", \"\", IF(IFERROR(VLOOKUP(D148, Interview!D:D, 1, FALSE), \"\")<>\"\", \"Yes\", IF(OR(C148=\"Fr\", C148=\"So\", AND(C148=\"Sr\", TODAY()<43646)), \"N/A\", \"No\")))","v":"No"}]
["Nick ","Mirandi","Fr","nxm5386",{"$f":"COUNTIF(Event1!$D:$D, D149) + COUNTIF(Event2!$D:$D, D149) + COUNTIF(Event3!$D:$D, D149) + COUNTIF(Event4!$D:$D, D149) + COUNTIF(Event5!$D:$D, D149) + COUNTIF(Event6!$D:$D, D149) + COUNTIF(Event7!$D:$D, D149) + COUNTIF(Event8!$D:$D, D149) + COUNTIF(Event9!$D:$D, D149) + COUNTIF(Event10!$D:$D, D149) + COUNTIF(Event11!$D:$D, D149) + COUNTIF(Event12!$D:$D, D149) + COUNTIF(Event13!$D:$D, D149) + COUNTIF(Event14!$D:$D, D149) + COUNTIF(Event15!$D:$D, D149) + COUNTIF(Event16!$D:$D, D149) + COUNTIF(Event17!$D:$D, D149) + COUNTIF(Event18!$D:$D, D149) + COUNTIF(Event19!$D:$D, D149) + COUNTIF(Event20!$D:$D, D149) + COUNTIF(Event21!$D:$D, D149) + COUNTIF(Event22!$D:$D, D149) + COUNTIF(Event23!$D:$D, D149) + COUNTIF(Event24!$D:$D, D149) + COUNTIF(Event25!$D:$D, D149) + 0","v":2},{"$f":"IF(D149=\"\", \"\", IF(IFERROR(VLOOKUP(D149, Dues!D:D, 1, FALSE), \"\")=\"\", \"No\", \"Yes\"))","v":"Yes"},{"$f":"IF(D149=\"\", \"\", IF(IFERROR(VLOOKUP(D149, Interview!D:D, 1, FALSE), \"\")<>\"\", \"Yes\", IF(OR(C149=\"Fr\", C149=\"So\", AND(C149=\"Sr\", TODAY()<43646)), \"N/A\", \"No\")))","v":"N/A"}]
["Bradley","Shafer","So","bxs437",{"$f":"COUNTIF(Event1!$D:$D, D150) + COUNTIF(Event2!$D:$D, D150) + COUNTIF(Event3!$D:$D, D150) + COUNTIF(Event4!$D:$D, D150) + COUNTIF(Event5!$D:$D, D150) + COUNTIF(Event6!$D:$D, D150) + COUNTIF(Event7!$D:$D, D150) + COUNTIF(Event8!$D:$D, D150) + COUNTIF(Event9!$D:$D, D150) + COUNTIF(Event10!$D:$D, D150) + COUNTIF(Event11!$D:$D, D150) + COUNTIF(Event12!$D:$D, D150) + COUNTIF(Event13!$D:$D, D150) + COUNTIF(Event14!$D:$D, D150) + COUNTIF(Event15!$D:$D, D150) + COUNTIF(Event16!$D:$D, D150) + COUNTIF(Event17!$D:$D, D150) + COUNTIF(Event18!$D:$D, D150) + COUNTIF(Event19!$D:$D, D150) + COUNTIF(Event20!$D:$D, D150) + COUNTIF(Event21!$D:$D, D150) + COUNTIF(Event22!$D:$D, D150) + COUNTIF(Event23!$D:$D, D150) + COUNTIF(Event24!$D:$D, D150) + COUNTIF(Event25!$D:$D, D150) + 0","v":2},{"$f":"IF(D150=\"\", \"\", IF(IFERROR(VLOOKUP(D150, Dues!D:D, 1, FALSE), \"\")=\"\", \"No\", \"Yes\"))","v":"Yes"},{"$f":"IF(D150=\"\", \"\", IF(IFERROR(VLOOKUP(D150, Interview!D:D, 1, FALSE), \"\")<>\"\", \"Yes\", IF(OR(C150=\"Fr\", C150=\"So\", AND(C150=\"Sr\", TODAY()<43646)), \"N/A\", \"No\")))","v":"N/A"}]
["Daniel","Marinelli","Fr","dbm5481",{"$f":"COUNTIF(Event1!$D:$D, D151) + COUNTIF(Event2!$D:$D, D151) + COUNTIF(Event3!$D:$D, D151) + COUNTIF(Event4!$D:$D, D151) + COUNTIF(Event5!$D:$D, D151) + COUNTIF(Event6!$D:$D, D151) + COUNTIF(Event7!$D:$D, D151) + COUNTIF(Event8!$D:$D, D151) + COUNTIF(Event9!$D:$D, D151) + COUNTIF(Event10!$D:$D, D151) + COUNTIF(Event11!$D:$D, D151) + COUNTIF(Event12!$D:$D, D151) + COUNTIF(Event13!$D:$D, D151) + COUNTIF(Event14!$D:$D, D151) + COUNTIF(Event15!$D:$D, D151) + COUNTIF(Event16!$D:$D, D151) + COUNTIF(Event17!$D:$D, D151) + COUNTIF(Event18!$D:$D, D151) + COUNTIF(Event19!$D:$D, D151) + COUNTIF(Event20!$D:$D, D151) + COUNTIF(Event21!$D:$D, D151) + COUNTIF(Event22!$D:$D, D151) + COUNTIF(Event23!$D:$D, D151) + COUNTIF(Event24!$D:$D, D151) + COUNTIF(Event25!$D:$D, D151) + 0","v":2},{"$f":"IF(D151=\"\", \"\", IF(IFERROR(VLOOKUP(D151, Dues!D:D, 1, FALSE), \"\")=\"\", \"No\", \"Yes\"))","v":"Yes"},{"$f":"IF(D151=\"\", \"\", IF(IFERROR(VLOOKUP(D151, Interview!D:D, 1, FALSE), \"\")<>\"\", \"Yes\", IF(OR(C151=\"Fr\", C151=\"So\", AND(C151=\"Sr\", TODAY()<43646)), \"N/A\", \"No\")))","v":"N/A"}]
["Nathan","Paisley","Fr","nmp5392",{"$f":"COUNTIF(Event1!$D:$D, D152) + COUNTIF(Event2!$D:$D, D152) + COUNTIF(Event3!$D:$D, D152) + COUNTIF(Event4!$D:$D, D152) + COUNTIF(Event5!$D:$D, D152) + COUNTIF(Event6!$D:$D, D152) + COUNTIF(Event7!$D:$D, D152) + COUNTIF(Event8!$D:$D, D152) + COUNTIF(Event9!$D:$D, D152) + COUNTIF(Event10!$D:$D, D152) + COUNTIF(Event11!$D:$D, D152) + COUNTIF(Event12!$D:$D, D152) + COUNTIF(Event13!$D:$D, D152) + COUNTIF(Event14!$D:$D, D152) + COUNTIF(Event15!$D:$D, D152) + COUNTIF(Event16!$D:$D, D152) + COUNTIF(Event17!$D:$D, D152) + COUNTIF(Event18!$D:$D, D152) + COUNTIF(Event19!$D:$D, D152) + COUNTIF(Event20!$D:$D, D152) + COUNTIF(Event21!$D:$D, D152) + COUNTIF(Event22!$D:$D, D152) + COUNTIF(Event23!$D:$D, D152) + COUNTIF(Event24!$D:$D, D152) + COUNTIF(Event25!$D:$D, D152) + 0","v":2},{"$f":"IF(D152=\"\", \"\", IF(IFERROR(VLOOKUP(D152, Dues!D:D, 1, FALSE), \"\")=\"\", \"No\", \"Yes\"))","v":"No"},{"$f":"IF(D152=\"\", \"\", IF(IFERROR(VLOOKUP(D152, Interview!D:D, 1, FALSE), \"\")<>\"\", \"Yes\", IF(OR(C152=\"Fr\", C152=\"So\", AND(C152=\"Sr\", TODAY()<43646)), \"N/A\", \"No\")))","v":"N/A"}]
["Kevin","Logan","So","ktl5134",{"$f":"COUNTIF(Event1!$D:$D, D153) + COUNTIF(Event2!$D:$D, D153) + COUNTIF(Event3!$D:$D, D153) + COUNTIF(Event4!$D:$D, D153) + COUNTIF(Event5!$D:$D, D153) + COUNTIF(Event6!$D:$D, D153) + COUNTIF(Event7!$D:$D, D153) + COUNTIF(Event8!$D:$D, D153) + COUNTIF(Event9!$D:$D, D153) + COUNTIF(Event10!$D:$D, D153) + COUNTIF(Event11!$D:$D, D153) + COUNTIF(Event12!$D:$D, D153) + COUNTIF(Event13!$D:$D, D153) + COUNTIF(Event14!$D:$D, D153) + COUNTIF(Event15!$D:$D, D153) + COUNTIF(Event16!$D:$D, D153) + COUNTIF(Event17!$D:$D, D153) + COUNTIF(Event18!$D:$D, D153) + COUNTIF(Event19!$D:$D, D153) + COUNTIF(Event20!$D:$D, D153) + COUNTIF(Event21!$D:$D, D153) + COUNTIF(Event22!$D:$D, D153) + COUNTIF(Event23!$D:$D, D153) + COUNTIF(Event24!$D:$D, D153) + COUNTIF(Event25!$D:$D, D153) + 0","v":2},{"$f":"IF(D153=\"\", \"\", IF(IFERROR(VLOOKUP(D153, Dues!D:D, 1, FALSE), \"\")=\"\", \"No\", \"Yes\"))","v":"Yes"},{"$f":"IF(D153=\"\", \"\", IF(IFERROR(VLOOKUP(D153, Interview!D:D, 1, FALSE), \"\")<>\"\", \"Yes\", IF(OR(C153=\"Fr\", C153=\"So\", AND(C153=\"Sr\", TODAY()<43646)), \"N/A\", \"No\")))","v":"Yes"}]
["Kody","Allen","Jr","kla5319",{"$f":"COUNTIF(Event1!$D:$D, D154) + COUNTIF(Event2!$D:$D, D154) + COUNTIF(Event3!$D:$D, D154) + COUNTIF(Event4!$D:$D, D154) + COUNTIF(Event5!$D:$D, D154) + COUNTIF(Event6!$D:$D, D154) + COUNTIF(Event7!$D:$D, D154) + COUNTIF(Event8!$D:$D, D154) + COUNTIF(Event9!$D:$D, D154) + COUNTIF(Event10!$D:$D, D154) + COUNTIF(Event11!$D:$D, D154) + COUNTIF(Event12!$D:$D, D154) + COUNTIF(Event13!$D:$D, D154) + COUNTIF(Event14!$D:$D, D154) + COUNTIF(Event15!$D:$D, D154) + COUNTIF(Event16!$D:$D, D154) + COUNTIF(Event17!$D:$D, D154) + COUNTIF(Event18!$D:$D, D154) + COUNTIF(Event19!$D:$D, D154) + COUNTIF(Event20!$D:$D, D154) + COUNTIF(Event21!$D:$D, D154) + COUNTIF(Event22!$D:$D, D154) + COUNTIF(Event23!$D:$D, D154) + COUNTIF(Event24!$D:$D, D154) + COUNTIF(Event25!$D:$D, D154) + 0","v":2},{"$f":"IF(D154=\"\", \"\", IF(IFERROR(VLOOKUP(D154, Dues!D:D, 1, FALSE), \"\")=\"\", \"No\", \"Yes\"))","v":"Yes"},{"$f":"IF(D154=\"\", \"\", IF(IFERROR(VLOOKUP(D154, Interview!D:D, 1, FALSE), \"\")<>\"\", \"Yes\", IF(OR(C154=\"Fr\", C154=\"So\", AND(C154=\"Sr\", TODAY()<43646)), \"N/A\", \"No\")))","v":"Yes"}]
["Jordan","Reiter","Jr","jar6334",{"$f":"COUNTIF(Event1!$D:$D, D155) + COUNTIF(Event2!$D:$D, D155) + COUNTIF(Event3!$D:$D, D155) + COUNTIF(Event4!$D:$D, D155) + COUNTIF(Event5!$D:$D, D155) + COUNTIF(Event6!$D:$D, D155) + COUNTIF(Event7!$D:$D, D155) + COUNTIF(Event8!$D:$D, D155) + COUNTIF(Event9!$D:$D, D155) + COUNTIF(Event10!$D:$D, D155) + COUNTIF(Event11!$D:$D, D155) + COUNTIF(Event12!$D:$D, D155) + COUNTIF(Event13!$D:$D, D155) + COUNTIF(Event14!$D:$D, D155) + COUNTIF(Event15!$D:$D, D155) + COUNTIF(Event16!$D:$D, D155) + COUNTIF(Event17!$D:$D, D155) + COUNTIF(Event18!$D:$D, D155) + COUNTIF(Event19!$D:$D, D155) + COUNTIF(Event20!$D:$D, D155) + COUNTIF(Event21!$D:$D, D155) + COUNTIF(Event22!$D:$D, D155) + COUNTIF(Event23!$D:$D, D155) + COUNTIF(Event24!$D:$D, D155) + COUNTIF(Event25!$D:$D, D155) + 0","v":2},{"$f":"IF(D155=\"\", \"\", IF(IFERROR(VLOOKUP(D155, Dues!D:D, 1, FALSE), \"\")=\"\", \"No\", \"Yes\"))","v":"Yes"},{"$f":"IF(D155=\"\", \"\", IF(IFERROR(VLOOKUP(D155, Interview!D:D, 1, FALSE), \"\")<>\"\", \"Yes\", IF(OR(C155=\"Fr\", C155=\"So\", AND(C155=\"Sr\", TODAY()<43646)), \"N/A\", \"No\")))","v":"Yes"}]
["Sean","Klavans","Jr","sak5707",{"$f":"COUNTIF(Event1!$D:$D, D156) + COUNTIF(Event2!$D:$D, D156) + COUNTIF(Event3!$D:$D, D156) + COUNTIF(Event4!$D:$D, D156) + COUNTIF(Event5!$D:$D, D156) + COUNTIF(Event6!$D:$D, D156) + COUNTIF(Event7!$D:$D, D156) + COUNTIF(Event8!$D:$D, D156) + COUNTIF(Event9!$D:$D, D156) + COUNTIF(Event10!$D:$D, D156) + COUNTIF(Event11!$D:$D, D156) + COUNTIF(Event12!$D:$D, D156) + COUNTIF(Event13!$D:$D, D156) + COUNTIF(Event14!$D:$D, D156) + COUNTIF(Event15!$D:$D, D156) + COUNTIF(Event16!$D:$D, D156) + COUNTIF(Event17!$D:$D, D156) + COUNTIF(Event18!$D:$D, D156) + COUNTIF(Event19!$D:$D, D156) + COUNTIF(Event20!$D:$D, D156) + COUNTIF(Event21!$D:$D, D156) + COUNTIF(Event22!$D:$D, D156) + COUNTIF(Event23!$D:$D, D156) + COUNTIF(Event24!$D:$D, D156) + COUNTIF(Event25!$D:$D, D156) + 0","v":2},{"$f":"IF(D156=\"\", \"\", IF(IFERROR(VLOOKUP(D156, Dues!D:D, 1, FALSE), \"\")=\"\", \"No\", \"Yes\"))","v":"Yes"},{"$f":"IF(D156=\"\", \"\", IF(IFERROR(VLOOKUP(D156, Interview!D:D, 1, FALSE), \"\")<>\"\", \"Yes\", IF(OR(C156=\"Fr\", C156=\"So\", AND(C156=\"Sr\", TODAY()<43646)), \"N/A\", \"No\")))","v":"Yes"}]
["Ruixin ","Han","So","rvh5387",{"$f":"COUNTIF(Event1!$D:$D, D157) + COUNTIF(Event2!$D:$D, D157) + COUNTIF(Event3!$D:$D, D157) + COUNTIF(Event4!$D:$D, D157) + COUNTIF(Event5!$D:$D, D157) + COUNTIF(Event6!$D:$D, D157) + COUNTIF(Event7!$D:$D, D157) + COUNTIF(Event8!$D:$D, D157) + COUNTIF(Event9!$D:$D, D157) + COUNTIF(Event10!$D:$D, D157) + COUNTIF(Event11!$D:$D, D157) + COUNTIF(Event12!$D:$D, D157) + COUNTIF(Event13!$D:$D, D157) + COUNTIF(Event14!$D:$D, D157) + COUNTIF(Event15!$D:$D, D157) + COUNTIF(Event16!$D:$D, D157) + COUNTIF(Event17!$D:$D, D157) + COUNTIF(Event18!$D:$D, D157) + COUNTIF(Event19!$D:$D, D157) + COUNTIF(Event20!$D:$D, D157) + COUNTIF(Event21!$D:$D, D157) + COUNTIF(Event22!$D:$D, D157) + COUNTIF(Event23!$D:$D, D157) + COUNTIF(Event24!$D:$D, D157) + COUNTIF(Event25!$D:$D, D157) + 0","v":2},{"$f":"IF(D157=\"\", \"\", IF(IFERROR(VLOOKUP(D157, Dues!D:D, 1, FALSE), \"\")=\"\", \"No\", \"Yes\"))","v":"Yes"},{"$f":"IF(D157=\"\", \"\", IF(IFERROR(VLOOKUP(D157, Interview!D:D, 1, FALSE), \"\")<>\"\", \"Yes\", IF(OR(C157=\"Fr\", C157=\"So\", AND(C157=\"Sr\", TODAY()<43646)), \"N/A\", \"No\")))","v":"N/A"}]
["Sabrina","Garcia","Sr","sqg5499",{"$f":"COUNTIF(Event1!$D:$D, D158) + COUNTIF(Event2!$D:$D, D158) + COUNTIF(Event3!$D:$D, D158) + COUNTIF(Event4!$D:$D, D158) + COUNTIF(Event5!$D:$D, D158) + COUNTIF(Event6!$D:$D, D158) + COUNTIF(Event7!$D:$D, D158) + COUNTIF(Event8!$D:$D, D158) + COUNTIF(Event9!$D:$D, D158) + COUNTIF(Event10!$D:$D, D158) + COUNTIF(Event11!$D:$D, D158) + COUNTIF(Event12!$D:$D, D158) + COUNTIF(Event13!$D:$D, D158) + COUNTIF(Event14!$D:$D, D158) + COUNTIF(Event15!$D:$D, D158) + COUNTIF(Event16!$D:$D, D158) + COUNTIF(Event17!$D:$D, D158) + COUNTIF(Event18!$D:$D, D158) + COUNTIF(Event19!$D:$D, D158) + COUNTIF(Event20!$D:$D, D158) + COUNTIF(Event21!$D:$D, D158) + COUNTIF(Event22!$D:$D, D158) + COUNTIF(Event23!$D:$D, D158) + COUNTIF(Event24!$D:$D, D158) + COUNTIF(Event25!$D:$D, D158) + 0","v":2},{"$f":"IF(D158=\"\", \"\", IF(IFERROR(VLOOKUP(D158, Dues!D:D, 1, FALSE), \"\")=\"\", \"No\", \"Yes\"))","v":"Yes"},{"$f":"IF(D158=\"\", \"\", IF(IFERROR(VLOOKUP(D158, Interview!D:D, 1, FALSE), \"\")<>\"\", \"Yes\", IF(OR(C158=\"Fr\", C158=\"So\", AND(C158=\"Sr\", TODAY()<43646)), \"N/A\", \"No\")))","v":"N/A"}]
["Jon","Mumford","So","jbm5733",{"$f":"COUNTIF(Event1!$D:$D, D159) + COUNTIF(Event2!$D:$D, D159) + COUNTIF(Event3!$D:$D, D159) + COUNTIF(Event4!$D:$D, D159) + COUNTIF(Event5!$D:$D, D159) + COUNTIF(Event6!$D:$D, D159) + COUNTIF(Event7!$D:$D, D159) + COUNTIF(Event8!$D:$D, D159) + COUNTIF(Event9!$D:$D, D159) + COUNTIF(Event10!$D:$D, D159) + COUNTIF(Event11!$D:$D, D159) + COUNTIF(Event12!$D:$D, D159) + COUNTIF(Event13!$D:$D, D159) + COUNTIF(Event14!$D:$D, D159) + COUNTIF(Event15!$D:$D, D159) + COUNTIF(Event16!$D:$D, D159) + COUNTIF(Event17!$D:$D, D159) + COUNTIF(Event18!$D:$D, D159) + COUNTIF(Event19!$D:$D, D159) + COUNTIF(Event20!$D:$D, D159) + COUNTIF(Event21!$D:$D, D159) + COUNTIF(Event22!$D:$D, D159) + COUNTIF(Event23!$D:$D, D159) + COUNTIF(Event24!$D:$D, D159) + COUNTIF(Event25!$D:$D, D159) + 0","v":2},{"$f":"IF(D159=\"\", \"\", IF(IFERROR(VLOOKUP(D159, Dues!D:D, 1, FALSE), \"\")=\"\", \"No\", \"Yes\"))","v":"Yes"},{"$f":"IF(D159=\"\", \"\", IF(IFERROR(VLOOKUP(D159, Interview!D:D, 1, FALSE), \"\")<>\"\", \"Yes\", IF(OR(C159=\"Fr\", C159=\"So\", AND(C159=\"Sr\", TODAY()<43646)), \"N/A\", \"No\")))","v":"N/A"}]
["Jaccob","Rausch","Fr","jmr6884",{"$f":"COUNTIF(Event1!$D:$D, D160) + COUNTIF(Event2!$D:$D, D160) + COUNTIF(Event3!$D:$D, D160) + COUNTIF(Event4!$D:$D, D160) + COUNTIF(Event5!$D:$D, D160) + COUNTIF(Event6!$D:$D, D160) + COUNTIF(Event7!$D:$D, D160) + COUNTIF(Event8!$D:$D, D160) + COUNTIF(Event9!$D:$D, D160) + COUNTIF(Event10!$D:$D, D160) + COUNTIF(Event11!$D:$D, D160) + COUNTIF(Event12!$D:$D, D160) + COUNTIF(Event13!$D:$D, D160) + COUNTIF(Event14!$D:$D, D160) + COUNTIF(Event15!$D:$D, D160) + COUNTIF(Event16!$D:$D, D160) + COUNTIF(Event17!$D:$D, D160) + COUNTIF(Event18!$D:$D, D160) + COUNTIF(Event19!$D:$D, D160) + COUNTIF(Event20!$D:$D, D160) + COUNTIF(Event21!$D:$D, D160) + COUNTIF(Event22!$D:$D, D160) + COUNTIF(Event23!$D:$D, D160) + COUNTIF(Event24!$D:$D, D160) + COUNTIF(Event25!$D:$D, D160) + 0","v":2},{"$f":"IF(D160=\"\", \"\", IF(IFERROR(VLOOKUP(D160, Dues!D:D, 1, FALSE), \"\")=\"\", \"No\", \"Yes\"))","v":"Yes"},{"$f":"IF(D160=\"\", \"\", IF(IFERROR(VLOOKUP(D160, Interview!D:D, 1, FALSE), \"\")<>\"\", \"Yes\", IF(OR(C160=\"Fr\", C160=\"So\", AND(C160=\"Sr\", TODAY()<43646)), \"N/A\", \"No\")))","v":"Yes"}]
["Alexandra","Stiles","Sr","als6468",{"$f":"COUNTIF(Event1!$D:$D, D161) + COUNTIF(Event2!$D:$D, D161) + COUNTIF(Event3!$D:$D, D161) + COUNTIF(Event4!$D:$D, D161) + COUNTIF(Event5!$D:$D, D161) + COUNTIF(Event6!$D:$D, D161) + COUNTIF(Event7!$D:$D, D161) + COUNTIF(Event8!$D:$D, D161) + COUNTIF(Event9!$D:$D, D161) + COUNTIF(Event10!$D:$D, D161) + COUNTIF(Event11!$D:$D, D161) + COUNTIF(Event12!$D:$D, D161) + COUNTIF(Event13!$D:$D, D161) + COUNTIF(Event14!$D:$D, D161) + COUNTIF(Event15!$D:$D, D161) + COUNTIF(Event16!$D:$D, D161) + COUNTIF(Event17!$D:$D, D161) + COUNTIF(Event18!$D:$D, D161) + COUNTIF(Event19!$D:$D, D161) + COUNTIF(Event20!$D:$D, D161) + COUNTIF(Event21!$D:$D, D161) + COUNTIF(Event22!$D:$D, D161) + COUNTIF(Event23!$D:$D, D161) + COUNTIF(Event24!$D:$D, D161) + COUNTIF(Event25!$D:$D, D161) + 0","v":2},{"$f":"IF(D161=\"\", \"\", IF(IFERROR(VLOOKUP(D161, Dues!D:D, 1, FALSE), \"\")=\"\", \"No\", \"Yes\"))","v":"No"},{"$f":"IF(D161=\"\", \"\", IF(IFERROR(VLOOKUP(D161, Interview!D:D, 1, FALSE), \"\")<>\"\", \"Yes\", IF(OR(C161=\"Fr\", C161=\"So\", AND(C161=\"Sr\", TODAY()<43646)), \"N/A\", \"No\")))","v":"N/A"}]
["Lisa","Winters","Sr","lvw5155",{"$f":"COUNTIF(Event1!$D:$D, D162) + COUNTIF(Event2!$D:$D, D162) + COUNTIF(Event3!$D:$D, D162) + COUNTIF(Event4!$D:$D, D162) + COUNTIF(Event5!$D:$D, D162) + COUNTIF(Event6!$D:$D, D162) + COUNTIF(Event7!$D:$D, D162) + COUNTIF(Event8!$D:$D, D162) + COUNTIF(Event9!$D:$D, D162) + COUNTIF(Event10!$D:$D, D162) + COUNTIF(Event11!$D:$D, D162) + COUNTIF(Event12!$D:$D, D162) + COUNTIF(Event13!$D:$D, D162) + COUNTIF(Event14!$D:$D, D162) + COUNTIF(Event15!$D:$D, D162) + COUNTIF(Event16!$D:$D, D162) + COUNTIF(Event17!$D:$D, D162) + COUNTIF(Event18!$D:$D, D162) + COUNTIF(Event19!$D:$D, D162) + COUNTIF(Event20!$D:$D, D162) + COUNTIF(Event21!$D:$D, D162) + COUNTIF(Event22!$D:$D, D162) + COUNTIF(Event23!$D:$D, D162) + COUNTIF(Event24!$D:$D, D162) + COUNTIF(Event25!$D:$D, D162) + 0","v":2},{"$f":"IF(D162=\"\", \"\", IF(IFERROR(VLOOKUP(D162, Dues!D:D, 1, FALSE), \"\")=\"\", \"No\", \"Yes\"))","v":"Yes"},{"$f":"IF(D162=\"\", \"\", IF(IFERROR(VLOOKUP(D162, Interview!D:D, 1, FALSE), \"\")<>\"\", \"Yes\", IF(OR(C162=\"Fr\", C162=\"So\", AND(C162=\"Sr\", TODAY()<43646)), \"N/A\", \"No\")))","v":"N/A"}]
["Nathan","Putt","Jr","nrp5173",{"$f":"COUNTIF(Event1!$D:$D, D163) + COUNTIF(Event2!$D:$D, D163) + COUNTIF(Event3!$D:$D, D163) + COUNTIF(Event4!$D:$D, D163) + COUNTIF(Event5!$D:$D, D163) + COUNTIF(Event6!$D:$D, D163) + COUNTIF(Event7!$D:$D, D163) + COUNTIF(Event8!$D:$D, D163) + COUNTIF(Event9!$D:$D, D163) + COUNTIF(Event10!$D:$D, D163) + COUNTIF(Event11!$D:$D, D163) + COUNTIF(Event12!$D:$D, D163) + COUNTIF(Event13!$D:$D, D163) + COUNTIF(Event14!$D:$D, D163) + COUNTIF(Event15!$D:$D, D163) + COUNTIF(Event16!$D:$D, D163) + COUNTIF(Event17!$D:$D, D163) + COUNTIF(Event18!$D:$D, D163) + COUNTIF(Event19!$D:$D, D163) + COUNTIF(Event20!$D:$D, D163) + COUNTIF(Event21!$D:$D, D163) + COUNTIF(Event22!$D:$D, D163) + COUNTIF(Event23!$D:$D, D163) + COUNTIF(Event24!$D:$D, D163) + COUNTIF(Event25!$D:$D, D163) + 0","v":2},{"$f":"IF(D163=\"\", \"\", IF(IFERROR(VLOOKUP(D163, Dues!D:D, 1, FALSE), \"\")=\"\", \"No\", \"Yes\"))","v":"No"},{"$f":"IF(D163=\"\", \"\", IF(IFERROR(VLOOKUP(D163, Interview!D:D, 1, FALSE), \"\")<>\"\", \"Yes\", IF(OR(C163=\"Fr\", C163=\"So\", AND(C163=\"Sr\", TODAY()<43646)), \"N/A\", \"No\")))","v":"Yes"}]
["Noah","Donten","So","nmd5348",{"$f":"COUNTIF(Event1!$D:$D, D164) + COUNTIF(Event2!$D:$D, D164) + COUNTIF(Event3!$D:$D, D164) + COUNTIF(Event4!$D:$D, D164) + COUNTIF(Event5!$D:$D, D164) + COUNTIF(Event6!$D:$D, D164) + COUNTIF(Event7!$D:$D, D164) + COUNTIF(Event8!$D:$D, D164) + COUNTIF(Event9!$D:$D, D164) + COUNTIF(Event10!$D:$D, D164) + COUNTIF(Event11!$D:$D, D164) + COUNTIF(Event12!$D:$D, D164) + COUNTIF(Event13!$D:$D, D164) + COUNTIF(Event14!$D:$D, D164) + COUNTIF(Event15!$D:$D, D164) + COUNTIF(Event16!$D:$D, D164) + COUNTIF(Event17!$D:$D, D164) + COUNTIF(Event18!$D:$D, D164) + COUNTIF(Event19!$D:$D, D164) + COUNTIF(Event20!$D:$D, D164) + COUNTIF(Event21!$D:$D, D164) + COUNTIF(Event22!$D:$D, D164) + COUNTIF(Event23!$D:$D, D164) + COUNTIF(Event24!$D:$D, D164) + COUNTIF(Event25!$D:$D, D164) + 0","v":2},{"$f":"IF(D164=\"\", \"\", IF(IFERROR(VLOOKUP(D164, Dues!D:D, 1, FALSE), \"\")=\"\", \"No\", \"Yes\"))","v":"Yes"},{"$f":"IF(D164=\"\", \"\", IF(IFERROR(VLOOKUP(D164, Interview!D:D, 1, FALSE), \"\")<>\"\", \"Yes\", IF(OR(C164=\"Fr\", C164=\"So\", AND(C164=\"Sr\", TODAY()<43646)), \"N/A\", \"No\")))","v":"N/A"}]
["Zhiyi","Han","Jr","zvh5145",{"$f":"COUNTIF(Event1!$D:$D, D165) + COUNTIF(Event2!$D:$D, D165) + COUNTIF(Event3!$D:$D, D165) + COUNTIF(Event4!$D:$D, D165) + COUNTIF(Event5!$D:$D, D165) + COUNTIF(Event6!$D:$D, D165) + COUNTIF(Event7!$D:$D, D165) + COUNTIF(Event8!$D:$D, D165) + COUNTIF(Event9!$D:$D, D165) + COUNTIF(Event10!$D:$D, D165) + COUNTIF(Event11!$D:$D, D165) + COUNTIF(Event12!$D:$D, D165) + COUNTIF(Event13!$D:$D, D165) + COUNTIF(Event14!$D:$D, D165) + COUNTIF(Event15!$D:$D, D165) + COUNTIF(Event16!$D:$D, D165) + COUNTIF(Event17!$D:$D, D165) + COUNTIF(Event18!$D:$D, D165) + COUNTIF(Event19!$D:$D, D165) + COUNTIF(Event20!$D:$D, D165) + COUNTIF(Event21!$D:$D, D165) + COUNTIF(Event22!$D:$D, D165) + COUNTIF(Event23!$D:$D, D165) + COUNTIF(Event24!$D:$D, D165) + COUNTIF(Event25!$D:$D, D165) + 0","v":2},{"$f":"IF(D165=\"\", \"\", IF(IFERROR(VLOOKUP(D165, Dues!D:D, 1, FALSE), \"\")=\"\", \"No\", \"Yes\"))","v":"No"},{"$f":"IF(D165=\"\", \"\", IF(IFERROR(VLOOKUP(D165, Interview!D:D, 1, FALSE), \"\")<>\"\", \"Yes\", IF(OR(C165=\"Fr\", C165=\"So\", AND(C165=\"Sr\", TODAY()<43646)), \"N/A\", \"No\")))","v":"Yes"}]
["Ruxin","Tong","Jr","rxt26",{"$f":"COUNTIF(Event1!$D:$D, D166) + COUNTIF(Event2!$D:$D, D166) + COUNTIF(Event3!$D:$D, D166) + COUNTIF(Event4!$D:$D, D166) + COUNTIF(Event5!$D:$D, D166) + COUNTIF(Event6!$D:$D, D166) + COUNTIF(Event7!$D:$D, D166) + COUNTIF(Event8!$D:$D, D166) + COUNTIF(Event9!$D:$D, D166) + COUNTIF(Event10!$D:$D, D166) + COUNTIF(Event11!$D:$D, D166) + COUNTIF(Event12!$D:$D, D166) + COUNTIF(Event13!$D:$D, D166) + COUNTIF(Event14!$D:$D, D166) + COUNTIF(Event15!$D:$D, D166) + COUNTIF(Event16!$D:$D, D166) + COUNTIF(Event17!$D:$D, D166) + COUNTIF(Event18!$D:$D, D166) + COUNTIF(Event19!$D:$D, D166) + COUNTIF(Event20!$D:$D, D166) + COUNTIF(Event21!$D:$D, D166) + COUNTIF(Event22!$D:$D, D166) + COUNTIF(Event23!$D:$D, D166) + COUNTIF(Event24!$D:$D, D166) + COUNTIF(Event25!$D:$D, D166) + 0","v":2},{"$f":"IF(D166=\"\", \"\", IF(IFERROR(VLOOKUP(D166, Dues!D:D, 1, FALSE), \"\")=\"\", \"No\", \"Yes\"))","v":"No"},{"$f":"IF(D166=\"\", \"\", IF(IFERROR(VLOOKUP(D166, Interview!D:D, 1, FALSE), \"\")<>\"\", \"Yes\", IF(OR(C166=\"Fr\", C166=\"So\", AND(C166=\"Sr\", TODAY()<43646)), \"N/A\", \"No\")))","v":"Yes"}]
["Haozheng","Chen","So","hjc5263",{"$f":"COUNTIF(Event1!$D:$D, D167) + COUNTIF(Event2!$D:$D, D167) + COUNTIF(Event3!$D:$D, D167) + COUNTIF(Event4!$D:$D, D167) + COUNTIF(Event5!$D:$D, D167) + COUNTIF(Event6!$D:$D, D167) + COUNTIF(Event7!$D:$D, D167) + COUNTIF(Event8!$D:$D, D167) + COUNTIF(Event9!$D:$D, D167) + COUNTIF(Event10!$D:$D, D167) + COUNTIF(Event11!$D:$D, D167) + COUNTIF(Event12!$D:$D, D167) + COUNTIF(Event13!$D:$D, D167) + COUNTIF(Event14!$D:$D, D167) + COUNTIF(Event15!$D:$D, D167) + COUNTIF(Event16!$D:$D, D167) + COUNTIF(Event17!$D:$D, D167) + COUNTIF(Event18!$D:$D, D167) + COUNTIF(Event19!$D:$D, D167) + COUNTIF(Event20!$D:$D, D167) + COUNTIF(Event21!$D:$D, D167) + COUNTIF(Event22!$D:$D, D167) + COUNTIF(Event23!$D:$D, D167) + COUNTIF(Event24!$D:$D, D167) + COUNTIF(Event25!$D:$D, D167) + 0","v":2},{"$f":"IF(D167=\"\", \"\", IF(IFERROR(VLOOKUP(D167, Dues!D:D, 1, FALSE), \"\")=\"\", \"No\", \"Yes\"))","v":"No"},{"$f":"IF(D167=\"\", \"\", IF(IFERROR(VLOOKUP(D167, Interview!D:D, 1, FALSE), \"\")<>\"\", \"Yes\", IF(OR(C167=\"Fr\", C167=\"So\", AND(C167=\"Sr\", TODAY()<43646)), \"N/A\", \"No\")))","v":"N/A"}]
["Thomas","Iliou","So","txi5033",{"$f":"COUNTIF(Event1!$D:$D, D168) + COUNTIF(Event2!$D:$D, D168) + COUNTIF(Event3!$D:$D, D168) + COUNTIF(Event4!$D:$D, D168) + COUNTIF(Event5!$D:$D, D168) + COUNTIF(Event6!$D:$D, D168) + COUNTIF(Event7!$D:$D, D168) + COUNTIF(Event8!$D:$D, D168) + COUNTIF(Event9!$D:$D, D168) + COUNTIF(Event10!$D:$D, D168) + COUNTIF(Event11!$D:$D, D168) + COUNTIF(Event12!$D:$D, D168) + COUNTIF(Event13!$D:$D, D168) + COUNTIF(Event14!$D:$D, D168) + COUNTIF(Event15!$D:$D, D168) + COUNTIF(Event16!$D:$D, D168) + COUNTIF(Event17!$D:$D, D168) + COUNTIF(Event18!$D:$D, D168) + COUNTIF(Event19!$D:$D, D168) + COUNTIF(Event20!$D:$D, D168) + COUNTIF(Event21!$D:$D, D168) + COUNTIF(Event22!$D:$D, D168) + COUNTIF(Event23!$D:$D, D168) + COUNTIF(Event24!$D:$D, D168) + COUNTIF(Event25!$D:$D, D168) + 0","v":2},{"$f":"IF(D168=\"\", \"\", IF(IFERROR(VLOOKUP(D168, Dues!D:D, 1, FALSE), \"\")=\"\", \"No\", \"Yes\"))","v":"No"},{"$f":"IF(D168=\"\", \"\", IF(IFERROR(VLOOKUP(D168, Interview!D:D, 1, FALSE), \"\")<>\"\", \"Yes\", IF(OR(C168=\"Fr\", C168=\"So\", AND(C168=\"Sr\", TODAY()<43646)), \"N/A\", \"No\")))","v":"N/A"}]
["Ryan","Podufal","SR","rwp5337",{"$f":"COUNTIF(Event1!$D:$D, D169) + COUNTIF(Event2!$D:$D, D169) + COUNTIF(Event3!$D:$D, D169) + COUNTIF(Event4!$D:$D, D169) + COUNTIF(Event5!$D:$D, D169) + COUNTIF(Event6!$D:$D, D169) + COUNTIF(Event7!$D:$D, D169) + COUNTIF(Event8!$D:$D, D169) + COUNTIF(Event9!$D:$D, D169) + COUNTIF(Event10!$D:$D, D169) + COUNTIF(Event11!$D:$D, D169) + COUNTIF(Event12!$D:$D, D169) + COUNTIF(Event13!$D:$D, D169) + COUNTIF(Event14!$D:$D, D169) + COUNTIF(Event15!$D:$D, D169) + COUNTIF(Event16!$D:$D, D169) + COUNTIF(Event17!$D:$D, D169) + COUNTIF(Event18!$D:$D, D169) + COUNTIF(Event19!$D:$D, D169) + COUNTIF(Event20!$D:$D, D169) + COUNTIF(Event21!$D:$D, D169) + COUNTIF(Event22!$D:$D, D169) + COUNTIF(Event23!$D:$D, D169) + COUNTIF(Event24!$D:$D, D169) + COUNTIF(Event25!$D:$D, D169) + 0","v":2},{"$f":"IF(D169=\"\", \"\", IF(IFERROR(VLOOKUP(D169, Dues!D:D, 1, FALSE), \"\")=\"\", \"No\", \"Yes\"))","v":"Yes"},{"$f":"IF(D169=\"\", \"\", IF(IFERROR(VLOOKUP(D169, Interview!D:D, 1, FALSE), \"\")<>\"\", \"Yes\", IF(OR(C169=\"Fr\", C169=\"So\", AND(C169=\"Sr\", TODAY()<43646)), \"N/A\", \"No\")))","v":"N/A"}]
["Yiling","Chen","Jr","ypc5131",{"$f":"COUNTIF(Event1!$D:$D, D170) + COUNTIF(Event2!$D:$D, D170) + COUNTIF(Event3!$D:$D, D170) + COUNTIF(Event4!$D:$D, D170) + COUNTIF(Event5!$D:$D, D170) + COUNTIF(Event6!$D:$D, D170) + COUNTIF(Event7!$D:$D, D170) + COUNTIF(Event8!$D:$D, D170) + COUNTIF(Event9!$D:$D, D170) + COUNTIF(Event10!$D:$D, D170) + COUNTIF(Event11!$D:$D, D170) + COUNTIF(Event12!$D:$D, D170) + COUNTIF(Event13!$D:$D, D170) + COUNTIF(Event14!$D:$D, D170) + COUNTIF(Event15!$D:$D, D170) + COUNTIF(Event16!$D:$D, D170) + COUNTIF(Event17!$D:$D, D170) + COUNTIF(Event18!$D:$D, D170) + COUNTIF(Event19!$D:$D, D170) + COUNTIF(Event20!$D:$D, D170) + COUNTIF(Event21!$D:$D, D170) + COUNTIF(Event22!$D:$D, D170) + COUNTIF(Event23!$D:$D, D170) + COUNTIF(Event24!$D:$D, D170) + COUNTIF(Event25!$D:$D, D170) + 0","v":2},{"$f":"IF(D170=\"\", \"\", IF(IFERROR(VLOOKUP(D170, Dues!D:D, 1, FALSE), \"\")=\"\", \"No\", \"Yes\"))","v":"No"},{"$f":"IF(D170=\"\", \"\", IF(IFERROR(VLOOKUP(D170, Interview!D:D, 1, FALSE), \"\")<>\"\", \"Yes\", IF(OR(C170=\"Fr\", C170=\"So\", AND(C170=\"Sr\", TODAY()<43646)), \"N/A\", \"No\")))","v":"No"}]
["yu","luo","Jr","yml5242",{"$f":"COUNTIF(Event1!$D:$D, D171) + COUNTIF(Event2!$D:$D, D171) + COUNTIF(Event3!$D:$D, D171) + COUNTIF(Event4!$D:$D, D171) + COUNTIF(Event5!$D:$D, D171) + COUNTIF(Event6!$D:$D, D171) + COUNTIF(Event7!$D:$D, D171) + COUNTIF(Event8!$D:$D, D171) + COUNTIF(Event9!$D:$D, D171) + COUNTIF(Event10!$D:$D, D171) + COUNTIF(Event11!$D:$D, D171) + COUNTIF(Event12!$D:$D, D171) + COUNTIF(Event13!$D:$D, D171) + COUNTIF(Event14!$D:$D, D171) + COUNTIF(Event15!$D:$D, D171) + COUNTIF(Event16!$D:$D, D171) + COUNTIF(Event17!$D:$D, D171) + COUNTIF(Event18!$D:$D, D171) + COUNTIF(Event19!$D:$D, D171) + COUNTIF(Event20!$D:$D, D171) + COUNTIF(Event21!$D:$D, D171) + COUNTIF(Event22!$D:$D, D171) + COUNTIF(Event23!$D:$D, D171) + COUNTIF(Event24!$D:$D, D171) + COUNTIF(Event25!$D:$D, D171) + 0","v":2},{"$f":"IF(D171=\"\", \"\", IF(IFERROR(VLOOKUP(D171, Dues!D:D, 1, FALSE), \"\")=\"\", \"No\", \"Yes\"))","v":"Yes"},{"$f":"IF(D171=\"\", \"\", IF(IFERROR(VLOOKUP(D171, Interview!D:D, 1, FALSE), \"\")<>\"\", \"Yes\", IF(OR(C171=\"Fr\", C171=\"So\", AND(C171=\"Sr\", TODAY()<43646)), \"N/A\", \"No\")))","v":"Yes"}]
["Molly ","Groarke","So","mag6298",{"$f":"COUNTIF(Event1!$D:$D, D172) + COUNTIF(Event2!$D:$D, D172) + COUNTIF(Event3!$D:$D, D172) + COUNTIF(Event4!$D:$D, D172) + COUNTIF(Event5!$D:$D, D172) + COUNTIF(Event6!$D:$D, D172) + COUNTIF(Event7!$D:$D, D172) + COUNTIF(Event8!$D:$D, D172) + COUNTIF(Event9!$D:$D, D172) + COUNTIF(Event10!$D:$D, D172) + COUNTIF(Event11!$D:$D, D172) + COUNTIF(Event12!$D:$D, D172) + COUNTIF(Event13!$D:$D, D172) + COUNTIF(Event14!$D:$D, D172) + COUNTIF(Event15!$D:$D, D172) + COUNTIF(Event16!$D:$D, D172) + COUNTIF(Event17!$D:$D, D172) + COUNTIF(Event18!$D:$D, D172) + COUNTIF(Event19!$D:$D, D172) + COUNTIF(Event20!$D:$D, D172) + COUNTIF(Event21!$D:$D, D172) + COUNTIF(Event22!$D:$D, D172) + COUNTIF(Event23!$D:$D, D172) + COUNTIF(Event24!$D:$D, D172) + COUNTIF(Event25!$D:$D, D172) + 0","v":2},{"$f":"IF(D172=\"\", \"\", IF(IFERROR(VLOOKUP(D172, Dues!D:D, 1, FALSE), \"\")=\"\", \"No\", \"Yes\"))","v":"Yes"},{"$f":"IF(D172=\"\", \"\", IF(IFERROR(VLOOKUP(D172, Interview!D:D, 1, FALSE), \"\")<>\"\", \"Yes\", IF(OR(C172=\"Fr\", C172=\"So\", AND(C172=\"Sr\", TODAY()<43646)), \"N/A\", \"No\")))","v":"N/A"}]
["Weilun","Zhang","Sr","wbz5017",{"$f":"COUNTIF(Event1!$D:$D, D173) + COUNTIF(Event2!$D:$D, D173) + COUNTIF(Event3!$D:$D, D173) + COUNTIF(Event4!$D:$D, D173) + COUNTIF(Event5!$D:$D, D173) + COUNTIF(Event6!$D:$D, D173) + COUNTIF(Event7!$D:$D, D173) + COUNTIF(Event8!$D:$D, D173) + COUNTIF(Event9!$D:$D, D173) + COUNTIF(Event10!$D:$D, D173) + COUNTIF(Event11!$D:$D, D173) + COUNTIF(Event12!$D:$D, D173) + COUNTIF(Event13!$D:$D, D173) + COUNTIF(Event14!$D:$D, D173) + COUNTIF(Event15!$D:$D, D173) + COUNTIF(Event16!$D:$D, D173) + COUNTIF(Event17!$D:$D, D173) + COUNTIF(Event18!$D:$D, D173) + COUNTIF(Event19!$D:$D, D173) + COUNTIF(Event20!$D:$D, D173) + COUNTIF(Event21!$D:$D, D173) + COUNTIF(Event22!$D:$D, D173) + COUNTIF(Event23!$D:$D, D173) + COUNTIF(Event24!$D:$D, D173) + COUNTIF(Event25!$D:$D, D173) + 0","v":2},{"$f":"IF(D173=\"\", \"\", IF(IFERROR(VLOOKUP(D173, Dues!D:D, 1, FALSE), \"\")=\"\", \"No\", \"Yes\"))","v":"No"},{"$f":"IF(D173=\"\", \"\", IF(IFERROR(VLOOKUP(D173, Interview!D:D, 1, FALSE), \"\")<>\"\", \"Yes\", IF(OR(C173=\"Fr\", C173=\"So\", AND(C173=\"Sr\", TODAY()<43646)), \"N/A\", \"No\")))","v":"N/A"}]
["Jake","Wiley","Jr","jrw5844",{"$f":"COUNTIF(Event1!$D:$D, D174) + COUNTIF(Event2!$D:$D, D174) + COUNTIF(Event3!$D:$D, D174) + COUNTIF(Event4!$D:$D, D174) + COUNTIF(Event5!$D:$D, D174) + COUNTIF(Event6!$D:$D, D174) + COUNTIF(Event7!$D:$D, D174) + COUNTIF(Event8!$D:$D, D174) + COUNTIF(Event9!$D:$D, D174) + COUNTIF(Event10!$D:$D, D174) + COUNTIF(Event11!$D:$D, D174) + COUNTIF(Event12!$D:$D, D174) + COUNTIF(Event13!$D:$D, D174) + COUNTIF(Event14!$D:$D, D174) + COUNTIF(Event15!$D:$D, D174) + COUNTIF(Event16!$D:$D, D174) + COUNTIF(Event17!$D:$D, D174) + COUNTIF(Event18!$D:$D, D174) + COUNTIF(Event19!$D:$D, D174) + COUNTIF(Event20!$D:$D, D174) + COUNTIF(Event21!$D:$D, D174) + COUNTIF(Event22!$D:$D, D174) + COUNTIF(Event23!$D:$D, D174) + COUNTIF(Event24!$D:$D, D174) + COUNTIF(Event25!$D:$D, D174) + 0","v":2},{"$f":"IF(D174=\"\", \"\", IF(IFERROR(VLOOKUP(D174, Dues!D:D, 1, FALSE), \"\")=\"\", \"No\", \"Yes\"))","v":"Yes"},{"$f":"IF(D174=\"\", \"\", IF(IFERROR(VLOOKUP(D174, Interview!D:D, 1, FALSE), \"\")<>\"\", \"Yes\", IF(OR(C174=\"Fr\", C174=\"So\", AND(C174=\"Sr\", TODAY()<43646)), \"N/A\", \"No\")))","v":"Yes"}]
["Henry","Ning","Sr","hon101",{"$f":"COUNTIF(Event1!$D:$D, D175) + COUNTIF(Event2!$D:$D, D175) + COUNTIF(Event3!$D:$D, D175) + COUNTIF(Event4!$D:$D, D175) + COUNTIF(Event5!$D:$D, D175) + COUNTIF(Event6!$D:$D, D175) + COUNTIF(Event7!$D:$D, D175) + COUNTIF(Event8!$D:$D, D175) + COUNTIF(Event9!$D:$D, D175) + COUNTIF(Event10!$D:$D, D175) + COUNTIF(Event11!$D:$D, D175) + COUNTIF(Event12!$D:$D, D175) + COUNTIF(Event13!$D:$D, D175) + COUNTIF(Event14!$D:$D, D175) + COUNTIF(Event15!$D:$D, D175) + COUNTIF(Event16!$D:$D, D175) + COUNTIF(Event17!$D:$D, D175) + COUNTIF(Event18!$D:$D, D175) + COUNTIF(Event19!$D:$D, D175) + COUNTIF(Event20!$D:$D, D175) + COUNTIF(Event21!$D:$D, D175) + COUNTIF(Event22!$D:$D, D175) + COUNTIF(Event23!$D:$D, D175) + COUNTIF(Event24!$D:$D, D175) + COUNTIF(Event25!$D:$D, D175) + 0","v":2},{"$f":"IF(D175=\"\", \"\", IF(IFERROR(VLOOKUP(D175, Dues!D:D, 1, FALSE), \"\")=\"\", \"No\", \"Yes\"))","v":"Yes"},{"$f":"IF(D175=\"\", \"\", IF(IFERROR(VLOOKUP(D175, Interview!D:D, 1, FALSE), \"\")<>\"\", \"Yes\", IF(OR(C175=\"Fr\", C175=\"So\", AND(C175=\"Sr\", TODAY()<43646)), \"N/A\", \"No\")))","v":"N/A"}]
["Rui","Zhao","Sr","ruz9",{"$f":"COUNTIF(Event1!$D:$D, D176) + COUNTIF(Event2!$D:$D, D176) + COUNTIF(Event3!$D:$D, D176) + COUNTIF(Event4!$D:$D, D176) + COUNTIF(Event5!$D:$D, D176) + COUNTIF(Event6!$D:$D, D176) + COUNTIF(Event7!$D:$D, D176) + COUNTIF(Event8!$D:$D, D176) + COUNTIF(Event9!$D:$D, D176) + COUNTIF(Event10!$D:$D, D176) + COUNTIF(Event11!$D:$D, D176) + COUNTIF(Event12!$D:$D, D176) + COUNTIF(Event13!$D:$D, D176) + COUNTIF(Event14!$D:$D, D176) + COUNTIF(Event15!$D:$D, D176) + COUNTIF(Event16!$D:$D, D176) + COUNTIF(Event17!$D:$D, D176) + COUNTIF(Event18!$D:$D, D176) + COUNTIF(Event19!$D:$D, D176) + COUNTIF(Event20!$D:$D, D176) + COUNTIF(Event21!$D:$D, D176) + COUNTIF(Event22!$D:$D, D176) + COUNTIF(Event23!$D:$D, D176) + COUNTIF(Event24!$D:$D, D176) + COUNTIF(Event25!$D:$D, D176) + 0","v":2},{"$f":"IF(D176=\"\", \"\", IF(IFERROR(VLOOKUP(D176, Dues!D:D, 1, FALSE), \"\")=\"\", \"No\", \"Yes\"))","v":"No"},{"$f":"IF(D176=\"\", \"\", IF(IFERROR(VLOOKUP(D176, Interview!D:D, 1, FALSE), \"\")<>\"\", \"Yes\", IF(OR(C176=\"Fr\", C176=\"So\", AND(C176=\"Sr\", TODAY()<43646)), \"N/A\", \"No\")))","v":"N/A"}]
["Mallory","Beard","Jr","mmb6124",{"$f":"COUNTIF(Event1!$D:$D, D177) + COUNTIF(Event2!$D:$D, D177) + COUNTIF(Event3!$D:$D, D177) + COUNTIF(Event4!$D:$D, D177) + COUNTIF(Event5!$D:$D, D177) + COUNTIF(Event6!$D:$D, D177) + COUNTIF(Event7!$D:$D, D177) + COUNTIF(Event8!$D:$D, D177) + COUNTIF(Event9!$D:$D, D177) + COUNTIF(Event10!$D:$D, D177) + COUNTIF(Event11!$D:$D, D177) + COUNTIF(Event12!$D:$D, D177) + COUNTIF(Event13!$D:$D, D177) + COUNTIF(Event14!$D:$D, D177) + COUNTIF(Event15!$D:$D, D177) + COUNTIF(Event16!$D:$D, D177) + COUNTIF(Event17!$D:$D, D177) + COUNTIF(Event18!$D:$D, D177) + COUNTIF(Event19!$D:$D, D177) + COUNTIF(Event20!$D:$D, D177) + COUNTIF(Event21!$D:$D, D177) + COUNTIF(Event22!$D:$D, D177) + COUNTIF(Event23!$D:$D, D177) + COUNTIF(Event24!$D:$D, D177) + COUNTIF(Event25!$D:$D, D177) + 0","v":2},{"$f":"IF(D177=\"\", \"\", IF(IFERROR(VLOOKUP(D177, Dues!D:D, 1, FALSE), \"\")=\"\", \"No\", \"Yes\"))","v":"Yes"},{"$f":"IF(D177=\"\", \"\", IF(IFERROR(VLOOKUP(D177, Interview!D:D, 1, FALSE), \"\")<>\"\", \"Yes\", IF(OR(C177=\"Fr\", C177=\"So\", AND(C177=\"Sr\", TODAY()<43646)), \"N/A\", \"No\")))","v":"Yes"}]
["Michael","Callahan","Sr","mgc5166",{"$f":"COUNTIF(Event1!$D:$D, D178) + COUNTIF(Event2!$D:$D, D178) + COUNTIF(Event3!$D:$D, D178) + COUNTIF(Event4!$D:$D, D178) + COUNTIF(Event5!$D:$D, D178) + COUNTIF(Event6!$D:$D, D178) + COUNTIF(Event7!$D:$D, D178) + COUNTIF(Event8!$D:$D, D178) + COUNTIF(Event9!$D:$D, D178) + COUNTIF(Event10!$D:$D, D178) + COUNTIF(Event11!$D:$D, D178) + COUNTIF(Event12!$D:$D, D178) + COUNTIF(Event13!$D:$D, D178) + COUNTIF(Event14!$D:$D, D178) + COUNTIF(Event15!$D:$D, D178) + COUNTIF(Event16!$D:$D, D178) + COUNTIF(Event17!$D:$D, D178) + COUNTIF(Event18!$D:$D, D178) + COUNTIF(Event19!$D:$D, D178) + COUNTIF(Event20!$D:$D, D178) + COUNTIF(Event21!$D:$D, D178) + COUNTIF(Event22!$D:$D, D178) + COUNTIF(Event23!$D:$D, D178) + COUNTIF(Event24!$D:$D, D178) + COUNTIF(Event25!$D:$D, D178) + 0","v":2},{"$f":"IF(D178=\"\", \"\", IF(IFERROR(VLOOKUP(D178, Dues!D:D, 1, FALSE), \"\")=\"\", \"No\", \"Yes\"))","v":"Yes"},{"$f":"IF(D178=\"\", \"\", IF(IFERROR(VLOOKUP(D178, Interview!D:D, 1, FALSE), \"\")<>\"\", \"Yes\", IF(OR(C178=\"Fr\", C178=\"So\", AND(C178=\"Sr\", TODAY()<43646)), \"N/A\", \"No\")))","v":"N/A"}]
["Katherine","Horan","Fr","kjh5927",{"$f":"COUNTIF(Event1!$D:$D, D179) + COUNTIF(Event2!$D:$D, D179) + COUNTIF(Event3!$D:$D, D179) + COUNTIF(Event4!$D:$D, D179) + COUNTIF(Event5!$D:$D, D179) + COUNTIF(Event6!$D:$D, D179) + COUNTIF(Event7!$D:$D, D179) + COUNTIF(Event8!$D:$D, D179) + COUNTIF(Event9!$D:$D, D179) + COUNTIF(Event10!$D:$D, D179) + COUNTIF(Event11!$D:$D, D179) + COUNTIF(Event12!$D:$D, D179) + COUNTIF(Event13!$D:$D, D179) + COUNTIF(Event14!$D:$D, D179) + COUNTIF(Event15!$D:$D, D179) + COUNTIF(Event16!$D:$D, D179) + COUNTIF(Event17!$D:$D, D179) + COUNTIF(Event18!$D:$D, D179) + COUNTIF(Event19!$D:$D, D179) + COUNTIF(Event20!$D:$D, D179) + COUNTIF(Event21!$D:$D, D179) + COUNTIF(Event22!$D:$D, D179) + COUNTIF(Event23!$D:$D, D179) + COUNTIF(Event24!$D:$D, D179) + COUNTIF(Event25!$D:$D, D179) + 0","v":1},{"$f":"IF(D179=\"\", \"\", IF(IFERROR(VLOOKUP(D179, Dues!D:D, 1, FALSE), \"\")=\"\", \"No\", \"Yes\"))","v":"No"},{"$f":"IF(D179=\"\", \"\", IF(IFERROR(VLOOKUP(D179, Interview!D:D, 1, FALSE), \"\")<>\"\", \"Yes\", IF(OR(C179=\"Fr\", C179=\"So\", AND(C179=\"Sr\", TODAY()<43646)), \"N/A\", \"No\")))","v":"N/A"}]
["Nick","Dingman","Fr","nvd5236",{"$f":"COUNTIF(Event1!$D:$D, D180) + COUNTIF(Event2!$D:$D, D180) + COUNTIF(Event3!$D:$D, D180) + COUNTIF(Event4!$D:$D, D180) + COUNTIF(Event5!$D:$D, D180) + COUNTIF(Event6!$D:$D, D180) + COUNTIF(Event7!$D:$D, D180) + COUNTIF(Event8!$D:$D, D180) + COUNTIF(Event9!$D:$D, D180) + COUNTIF(Event10!$D:$D, D180) + COUNTIF(Event11!$D:$D, D180) + COUNTIF(Event12!$D:$D, D180) + COUNTIF(Event13!$D:$D, D180) + COUNTIF(Event14!$D:$D, D180) + COUNTIF(Event15!$D:$D, D180) + COUNTIF(Event16!$D:$D, D180) + COUNTIF(Event17!$D:$D, D180) + COUNTIF(Event18!$D:$D, D180) + COUNTIF(Event19!$D:$D, D180) + COUNTIF(Event20!$D:$D, D180) + COUNTIF(Event21!$D:$D, D180) + COUNTIF(Event22!$D:$D, D180) + COUNTIF(Event23!$D:$D, D180) + COUNTIF(Event24!$D:$D, D180) + COUNTIF(Event25!$D:$D, D180) + 0","v":1},{"$f":"IF(D180=\"\", \"\", IF(IFERROR(VLOOKUP(D180, Dues!D:D, 1, FALSE), \"\")=\"\", \"No\", \"Yes\"))","v":"Yes"},{"$f":"IF(D180=\"\", \"\", IF(IFERROR(VLOOKUP(D180, Interview!D:D, 1, FALSE), \"\")<>\"\", \"Yes\", IF(OR(C180=\"Fr\", C180=\"So\", AND(C180=\"Sr\", TODAY()<43646)), \"N/A\", \"No\")))","v":"N/A"}]
["Anna","Leon","Fr","ajl6225",{"$f":"COUNTIF(Event1!$D:$D, D181) + COUNTIF(Event2!$D:$D, D181) + COUNTIF(Event3!$D:$D, D181) + COUNTIF(Event4!$D:$D, D181) + COUNTIF(Event5!$D:$D, D181) + COUNTIF(Event6!$D:$D, D181) + COUNTIF(Event7!$D:$D, D181) + COUNTIF(Event8!$D:$D, D181) + COUNTIF(Event9!$D:$D, D181) + COUNTIF(Event10!$D:$D, D181) + COUNTIF(Event11!$D:$D, D181) + COUNTIF(Event12!$D:$D, D181) + COUNTIF(Event13!$D:$D, D181) + COUNTIF(Event14!$D:$D, D181) + COUNTIF(Event15!$D:$D, D181) + COUNTIF(Event16!$D:$D, D181) + COUNTIF(Event17!$D:$D, D181) + COUNTIF(Event18!$D:$D, D181) + COUNTIF(Event19!$D:$D, D181) + COUNTIF(Event20!$D:$D, D181) + COUNTIF(Event21!$D:$D, D181) + COUNTIF(Event22!$D:$D, D181) + COUNTIF(Event23!$D:$D, D181) + COUNTIF(Event24!$D:$D, D181) + COUNTIF(Event25!$D:$D, D181) + 0","v":1},{"$f":"IF(D181=\"\", \"\", IF(IFERROR(VLOOKUP(D181, Dues!D:D, 1, FALSE), \"\")=\"\", \"No\", \"Yes\"))","v":"No"},{"$f":"IF(D181=\"\", \"\", IF(IFERROR(VLOOKUP(D181, Interview!D:D, 1, FALSE), \"\")<>\"\", \"Yes\", IF(OR(C181=\"Fr\", C181=\"So\", AND(C181=\"Sr\", TODAY()<43646)), \"N/A\", \"No\")))","v":"N/A"}]
["Holly","Linkoski","Sr","hal5157",{"$f":"COUNTIF(Event1!$D:$D, D182) + COUNTIF(Event2!$D:$D, D182) + COUNTIF(Event3!$D:$D, D182) + COUNTIF(Event4!$D:$D, D182) + COUNTIF(Event5!$D:$D, D182) + COUNTIF(Event6!$D:$D, D182) + COUNTIF(Event7!$D:$D, D182) + COUNTIF(Event8!$D:$D, D182) + COUNTIF(Event9!$D:$D, D182) + COUNTIF(Event10!$D:$D, D182) + COUNTIF(Event11!$D:$D, D182) + COUNTIF(Event12!$D:$D, D182) + COUNTIF(Event13!$D:$D, D182) + COUNTIF(Event14!$D:$D, D182) + COUNTIF(Event15!$D:$D, D182) + COUNTIF(Event16!$D:$D, D182) + COUNTIF(Event17!$D:$D, D182) + COUNTIF(Event18!$D:$D, D182) + COUNTIF(Event19!$D:$D, D182) + COUNTIF(Event20!$D:$D, D182) + COUNTIF(Event21!$D:$D, D182) + COUNTIF(Event22!$D:$D, D182) + COUNTIF(Event23!$D:$D, D182) + COUNTIF(Event24!$D:$D, D182) + COUNTIF(Event25!$D:$D, D182) + 0","v":1},{"$f":"IF(D182=\"\", \"\", IF(IFERROR(VLOOKUP(D182, Dues!D:D, 1, FALSE), \"\")=\"\", \"No\", \"Yes\"))","v":"Yes"},{"$f":"IF(D182=\"\", \"\", IF(IFERROR(VLOOKUP(D182, Interview!D:D, 1, FALSE), \"\")<>\"\", \"Yes\", IF(OR(C182=\"Fr\", C182=\"So\", AND(C182=\"Sr\", TODAY()<43646)), \"N/A\", \"No\")))","v":"N/A"}]
["Paige","Hughes","So","plh5156",{"$f":"COUNTIF(Event1!$D:$D, D183) + COUNTIF(Event2!$D:$D, D183) + COUNTIF(Event3!$D:$D, D183) + COUNTIF(Event4!$D:$D, D183) + COUNTIF(Event5!$D:$D, D183) + COUNTIF(Event6!$D:$D, D183) + COUNTIF(Event7!$D:$D, D183) + COUNTIF(Event8!$D:$D, D183) + COUNTIF(Event9!$D:$D, D183) + COUNTIF(Event10!$D:$D, D183) + COUNTIF(Event11!$D:$D, D183) + COUNTIF(Event12!$D:$D, D183) + COUNTIF(Event13!$D:$D, D183) + COUNTIF(Event14!$D:$D, D183) + COUNTIF(Event15!$D:$D, D183) + COUNTIF(Event16!$D:$D, D183) + COUNTIF(Event17!$D:$D, D183) + COUNTIF(Event18!$D:$D, D183) + COUNTIF(Event19!$D:$D, D183) + COUNTIF(Event20!$D:$D, D183) + COUNTIF(Event21!$D:$D, D183) + COUNTIF(Event22!$D:$D, D183) + COUNTIF(Event23!$D:$D, D183) + COUNTIF(Event24!$D:$D, D183) + COUNTIF(Event25!$D:$D, D183) + 0","v":1},{"$f":"IF(D183=\"\", \"\", IF(IFERROR(VLOOKUP(D183, Dues!D:D, 1, FALSE), \"\")=\"\", \"No\", \"Yes\"))","v":"Yes"},{"$f":"IF(D183=\"\", \"\", IF(IFERROR(VLOOKUP(D183, Interview!D:D, 1, FALSE), \"\")<>\"\", \"Yes\", IF(OR(C183=\"Fr\", C183=\"So\", AND(C183=\"Sr\", TODAY()<43646)), \"N/A\", \"No\")))","v":"N/A"}]
["Michael","Torbert","Fr","mat5816",{"$f":"COUNTIF(Event1!$D:$D, D184) + COUNTIF(Event2!$D:$D, D184) + COUNTIF(Event3!$D:$D, D184) + COUNTIF(Event4!$D:$D, D184) + COUNTIF(Event5!$D:$D, D184) + COUNTIF(Event6!$D:$D, D184) + COUNTIF(Event7!$D:$D, D184) + COUNTIF(Event8!$D:$D, D184) + COUNTIF(Event9!$D:$D, D184) + COUNTIF(Event10!$D:$D, D184) + COUNTIF(Event11!$D:$D, D184) + COUNTIF(Event12!$D:$D, D184) + COUNTIF(Event13!$D:$D, D184) + COUNTIF(Event14!$D:$D, D184) + COUNTIF(Event15!$D:$D, D184) + COUNTIF(Event16!$D:$D, D184) + COUNTIF(Event17!$D:$D, D184) + COUNTIF(Event18!$D:$D, D184) + COUNTIF(Event19!$D:$D, D184) + COUNTIF(Event20!$D:$D, D184) + COUNTIF(Event21!$D:$D, D184) + COUNTIF(Event22!$D:$D, D184) + COUNTIF(Event23!$D:$D, D184) + COUNTIF(Event24!$D:$D, D184) + COUNTIF(Event25!$D:$D, D184) + 0","v":1},{"$f":"IF(D184=\"\", \"\", IF(IFERROR(VLOOKUP(D184, Dues!D:D, 1, FALSE), \"\")=\"\", \"No\", \"Yes\"))","v":"No"},{"$f":"IF(D184=\"\", \"\", IF(IFERROR(VLOOKUP(D184, Interview!D:D, 1, FALSE), \"\")<>\"\", \"Yes\", IF(OR(C184=\"Fr\", C184=\"So\", AND(C184=\"Sr\", TODAY()<43646)), \"N/A\", \"No\")))","v":"N/A"}]
["Julia","Semmer","Fr","jvs6630",{"$f":"COUNTIF(Event1!$D:$D, D185) + COUNTIF(Event2!$D:$D, D185) + COUNTIF(Event3!$D:$D, D185) + COUNTIF(Event4!$D:$D, D185) + COUNTIF(Event5!$D:$D, D185) + COUNTIF(Event6!$D:$D, D185) + COUNTIF(Event7!$D:$D, D185) + COUNTIF(Event8!$D:$D, D185) + COUNTIF(Event9!$D:$D, D185) + COUNTIF(Event10!$D:$D, D185) + COUNTIF(Event11!$D:$D, D185) + COUNTIF(Event12!$D:$D, D185) + COUNTIF(Event13!$D:$D, D185) + COUNTIF(Event14!$D:$D, D185) + COUNTIF(Event15!$D:$D, D185) + COUNTIF(Event16!$D:$D, D185) + COUNTIF(Event17!$D:$D, D185) + COUNTIF(Event18!$D:$D, D185) + COUNTIF(Event19!$D:$D, D185) + COUNTIF(Event20!$D:$D, D185) + COUNTIF(Event21!$D:$D, D185) + COUNTIF(Event22!$D:$D, D185) + COUNTIF(Event23!$D:$D, D185) + COUNTIF(Event24!$D:$D, D185) + COUNTIF(Event25!$D:$D, D185) + 0","v":1},{"$f":"IF(D185=\"\", \"\", IF(IFERROR(VLOOKUP(D185, Dues!D:D, 1, FALSE), \"\")=\"\", \"No\", \"Yes\"))","v":"No"},{"$f":"IF(D185=\"\", \"\", IF(IFERROR(VLOOKUP(D185, Interview!D:D, 1, FALSE), \"\")<>\"\", \"Yes\", IF(OR(C185=\"Fr\", C185=\"So\", AND(C185=\"Sr\", TODAY()<43646)), \"N/A\", \"No\")))","v":"N/A"}]
["joseph","roantree","So","jzr98",{"$f":"COUNTIF(Event1!$D:$D, D186) + COUNTIF(Event2!$D:$D, D186) + COUNTIF(Event3!$D:$D, D186) + COUNTIF(Event4!$D:$D, D186) + COUNTIF(Event5!$D:$D, D186) + COUNTIF(Event6!$D:$D, D186) + COUNTIF(Event7!$D:$D, D186) + COUNTIF(Event8!$D:$D, D186) + COUNTIF(Event9!$D:$D, D186) + COUNTIF(Event10!$D:$D, D186) + COUNTIF(Event11!$D:$D, D186) + COUNTIF(Event12!$D:$D, D186) + COUNTIF(Event13!$D:$D, D186) + COUNTIF(Event14!$D:$D, D186) + COUNTIF(Event15!$D:$D, D186) + COUNTIF(Event16!$D:$D, D186) + COUNTIF(Event17!$D:$D, D186) + COUNTIF(Event18!$D:$D, D186) + COUNTIF(Event19!$D:$D, D186) + COUNTIF(Event20!$D:$D, D186) + COUNTIF(Event21!$D:$D, D186) + COUNTIF(Event22!$D:$D, D186) + COUNTIF(Event23!$D:$D, D186) + COUNTIF(Event24!$D:$D, D186) + COUNTIF(Event25!$D:$D, D186) + 0","v":1},{"$f":"IF(D186=\"\", \"\", IF(IFERROR(VLOOKUP(D186, Dues!D:D, 1, FALSE), \"\")=\"\", \"No\", \"Yes\"))","v":"Yes"},{"$f":"IF(D186=\"\", \"\", IF(IFERROR(VLOOKUP(D186, Interview!D:D, 1, FALSE), \"\")<>\"\", \"Yes\", IF(OR(C186=\"Fr\", C186=\"So\", AND(C186=\"Sr\", TODAY()<43646)), \"N/A\", \"No\")))","v":"N/A"}]
["erin","wicker","Fr","euw60",{"$f":"COUNTIF(Event1!$D:$D, D187) + COUNTIF(Event2!$D:$D, D187) + COUNTIF(Event3!$D:$D, D187) + COUNTIF(Event4!$D:$D, D187) + COUNTIF(Event5!$D:$D, D187) + COUNTIF(Event6!$D:$D, D187) + COUNTIF(Event7!$D:$D, D187) + COUNTIF(Event8!$D:$D, D187) + COUNTIF(Event9!$D:$D, D187) + COUNTIF(Event10!$D:$D, D187) + COUNTIF(Event11!$D:$D, D187) + COUNTIF(Event12!$D:$D, D187) + COUNTIF(Event13!$D:$D, D187) + COUNTIF(Event14!$D:$D, D187) + COUNTIF(Event15!$D:$D, D187) + COUNTIF(Event16!$D:$D, D187) + COUNTIF(Event17!$D:$D, D187) + COUNTIF(Event18!$D:$D, D187) + COUNTIF(Event19!$D:$D, D187) + COUNTIF(Event20!$D:$D, D187) + COUNTIF(Event21!$D:$D, D187) + COUNTIF(Event22!$D:$D, D187) + COUNTIF(Event23!$D:$D, D187) + COUNTIF(Event24!$D:$D, D187) + COUNTIF(Event25!$D:$D, D187) + 0","v":1},{"$f":"IF(D187=\"\", \"\", IF(IFERROR(VLOOKUP(D187, Dues!D:D, 1, FALSE), \"\")=\"\", \"No\", \"Yes\"))","v":"No"},{"$f":"IF(D187=\"\", \"\", IF(IFERROR(VLOOKUP(D187, Interview!D:D, 1, FALSE), \"\")<>\"\", \"Yes\", IF(OR(C187=\"Fr\", C187=\"So\", AND(C187=\"Sr\", TODAY()<43646)), \"N/A\", \"No\")))","v":"N/A"}]
["Sawyer","Parks","Fr","sjp5946",{"$f":"COUNTIF(Event1!$D:$D, D188) + COUNTIF(Event2!$D:$D, D188) + COUNTIF(Event3!$D:$D, D188) + COUNTIF(Event4!$D:$D, D188) + COUNTIF(Event5!$D:$D, D188) + COUNTIF(Event6!$D:$D, D188) + COUNTIF(Event7!$D:$D, D188) + COUNTIF(Event8!$D:$D, D188) + COUNTIF(Event9!$D:$D, D188) + COUNTIF(Event10!$D:$D, D188) + COUNTIF(Event11!$D:$D, D188) + COUNTIF(Event12!$D:$D, D188) + COUNTIF(Event13!$D:$D, D188) + COUNTIF(Event14!$D:$D, D188) + COUNTIF(Event15!$D:$D, D188) + COUNTIF(Event16!$D:$D, D188) + COUNTIF(Event17!$D:$D, D188) + COUNTIF(Event18!$D:$D, D188) + COUNTIF(Event19!$D:$D, D188) + COUNTIF(Event20!$D:$D, D188) + COUNTIF(Event21!$D:$D, D188) + COUNTIF(Event22!$D:$D, D188) + COUNTIF(Event23!$D:$D, D188) + COUNTIF(Event24!$D:$D, D188) + COUNTIF(Event25!$D:$D, D188) + 0","v":1},{"$f":"IF(D188=\"\", \"\", IF(IFERROR(VLOOKUP(D188, Dues!D:D, 1, FALSE), \"\")=\"\", \"No\", \"Yes\"))","v":"No"},{"$f":"IF(D188=\"\", \"\", IF(IFERROR(VLOOKUP(D188, Interview!D:D, 1, FALSE), \"\")<>\"\", \"Yes\", IF(OR(C188=\"Fr\", C188=\"So\", AND(C188=\"Sr\", TODAY()<43646)), \"N/A\", \"No\")))","v":"N/A"}]
["Katie","Ridenour","Fr","kmr70",{"$f":"COUNTIF(Event1!$D:$D, D189) + COUNTIF(Event2!$D:$D, D189) + COUNTIF(Event3!$D:$D, D189) + COUNTIF(Event4!$D:$D, D189) + COUNTIF(Event5!$D:$D, D189) + COUNTIF(Event6!$D:$D, D189) + COUNTIF(Event7!$D:$D, D189) + COUNTIF(Event8!$D:$D, D189) + COUNTIF(Event9!$D:$D, D189) + COUNTIF(Event10!$D:$D, D189) + COUNTIF(Event11!$D:$D, D189) + COUNTIF(Event12!$D:$D, D189) + COUNTIF(Event13!$D:$D, D189) + COUNTIF(Event14!$D:$D, D189) + COUNTIF(Event15!$D:$D, D189) + COUNTIF(Event16!$D:$D, D189) + COUNTIF(Event17!$D:$D, D189) + COUNTIF(Event18!$D:$D, D189) + COUNTIF(Event19!$D:$D, D189) + COUNTIF(Event20!$D:$D, D189) + COUNTIF(Event21!$D:$D, D189) + COUNTIF(Event22!$D:$D, D189) + COUNTIF(Event23!$D:$D, D189) + COUNTIF(Event24!$D:$D, D189) + COUNTIF(Event25!$D:$D, D189) + 0","v":1},{"$f":"IF(D189=\"\", \"\", IF(IFERROR(VLOOKUP(D189, Dues!D:D, 1, FALSE), \"\")=\"\", \"No\", \"Yes\"))","v":"No"},{"$f":"IF(D189=\"\", \"\", IF(IFERROR(VLOOKUP(D189, Interview!D:D, 1, FALSE), \"\")<>\"\", \"Yes\", IF(OR(C189=\"Fr\", C189=\"So\", AND(C189=\"Sr\", TODAY()<43646)), \"N/A\", \"No\")))","v":"N/A"}]
["Benjamin","Koch","Fr","buk99",{"$f":"COUNTIF(Event1!$D:$D, D190) + COUNTIF(Event2!$D:$D, D190) + COUNTIF(Event3!$D:$D, D190) + COUNTIF(Event4!$D:$D, D190) + COUNTIF(Event5!$D:$D, D190) + COUNTIF(Event6!$D:$D, D190) + COUNTIF(Event7!$D:$D, D190) + COUNTIF(Event8!$D:$D, D190) + COUNTIF(Event9!$D:$D, D190) + COUNTIF(Event10!$D:$D, D190) + COUNTIF(Event11!$D:$D, D190) + COUNTIF(Event12!$D:$D, D190) + COUNTIF(Event13!$D:$D, D190) + COUNTIF(Event14!$D:$D, D190) + COUNTIF(Event15!$D:$D, D190) + COUNTIF(Event16!$D:$D, D190) + COUNTIF(Event17!$D:$D, D190) + COUNTIF(Event18!$D:$D, D190) + COUNTIF(Event19!$D:$D, D190) + COUNTIF(Event20!$D:$D, D190) + COUNTIF(Event21!$D:$D, D190) + COUNTIF(Event22!$D:$D, D190) + COUNTIF(Event23!$D:$D, D190) + COUNTIF(Event24!$D:$D, D190) + COUNTIF(Event25!$D:$D, D190) + 0","v":1},{"$f":"IF(D190=\"\", \"\", IF(IFERROR(VLOOKUP(D190, Dues!D:D, 1, FALSE), \"\")=\"\", \"No\", \"Yes\"))","v":"No"},{"$f":"IF(D190=\"\", \"\", IF(IFERROR(VLOOKUP(D190, Interview!D:D, 1, FALSE), \"\")<>\"\", \"Yes\", IF(OR(C190=\"Fr\", C190=\"So\", AND(C190=\"Sr\", TODAY()<43646)), \"N/A\", \"No\")))","v":"N/A"}]
["Kevin","Westfall","Fr","kpw5279",{"$f":"COUNTIF(Event1!$D:$D, D191) + COUNTIF(Event2!$D:$D, D191) + COUNTIF(Event3!$D:$D, D191) + COUNTIF(Event4!$D:$D, D191) + COUNTIF(Event5!$D:$D, D191) + COUNTIF(Event6!$D:$D, D191) + COUNTIF(Event7!$D:$D, D191) + COUNTIF(Event8!$D:$D, D191) + COUNTIF(Event9!$D:$D, D191) + COUNTIF(Event10!$D:$D, D191) + COUNTIF(Event11!$D:$D, D191) + COUNTIF(Event12!$D:$D, D191) + COUNTIF(Event13!$D:$D, D191) + COUNTIF(Event14!$D:$D, D191) + COUNTIF(Event15!$D:$D, D191) + COUNTIF(Event16!$D:$D, D191) + COUNTIF(Event17!$D:$D, D191) + COUNTIF(Event18!$D:$D, D191) + COUNTIF(Event19!$D:$D, D191) + COUNTIF(Event20!$D:$D, D191) + COUNTIF(Event21!$D:$D, D191) + COUNTIF(Event22!$D:$D, D191) + COUNTIF(Event23!$D:$D, D191) + COUNTIF(Event24!$D:$D, D191) + COUNTIF(Event25!$D:$D, D191) + 0","v":1},{"$f":"IF(D191=\"\", \"\", IF(IFERROR(VLOOKUP(D191, Dues!D:D, 1, FALSE), \"\")=\"\", \"No\", \"Yes\"))","v":"No"},{"$f":"IF(D191=\"\", \"\", IF(IFERROR(VLOOKUP(D191, Interview!D:D, 1, FALSE), \"\")<>\"\", \"Yes\", IF(OR(C191=\"Fr\", C191=\"So\", AND(C191=\"Sr\", TODAY()<43646)), \"N/A\", \"No\")))","v":"N/A"}]
["Nikolas","Steacker","Fr","nps5409",{"$f":"COUNTIF(Event1!$D:$D, D192) + COUNTIF(Event2!$D:$D, D192) + COUNTIF(Event3!$D:$D, D192) + COUNTIF(Event4!$D:$D, D192) + COUNTIF(Event5!$D:$D, D192) + COUNTIF(Event6!$D:$D, D192) + COUNTIF(Event7!$D:$D, D192) + COUNTIF(Event8!$D:$D, D192) + COUNTIF(Event9!$D:$D, D192) + COUNTIF(Event10!$D:$D, D192) + COUNTIF(Event11!$D:$D, D192) + COUNTIF(Event12!$D:$D, D192) + COUNTIF(Event13!$D:$D, D192) + COUNTIF(Event14!$D:$D, D192) + COUNTIF(Event15!$D:$D, D192) + COUNTIF(Event16!$D:$D, D192) + COUNTIF(Event17!$D:$D, D192) + COUNTIF(Event18!$D:$D, D192) + COUNTIF(Event19!$D:$D, D192) + COUNTIF(Event20!$D:$D, D192) + COUNTIF(Event21!$D:$D, D192) + COUNTIF(Event22!$D:$D, D192) + COUNTIF(Event23!$D:$D, D192) + COUNTIF(Event24!$D:$D, D192) + COUNTIF(Event25!$D:$D, D192) + 0","v":1},{"$f":"IF(D192=\"\", \"\", IF(IFERROR(VLOOKUP(D192, Dues!D:D, 1, FALSE), \"\")=\"\", \"No\", \"Yes\"))","v":"Yes"},{"$f":"IF(D192=\"\", \"\", IF(IFERROR(VLOOKUP(D192, Interview!D:D, 1, FALSE), \"\")<>\"\", \"Yes\", IF(OR(C192=\"Fr\", C192=\"So\", AND(C192=\"Sr\", TODAY()<43646)), \"N/A\", \"No\")))","v":"N/A"}]
["Paige","Glover","Fr","pag5319",{"$f":"COUNTIF(Event1!$D:$D, D193) + COUNTIF(Event2!$D:$D, D193) + COUNTIF(Event3!$D:$D, D193) + COUNTIF(Event4!$D:$D, D193) + COUNTIF(Event5!$D:$D, D193) + COUNTIF(Event6!$D:$D, D193) + COUNTIF(Event7!$D:$D, D193) + COUNTIF(Event8!$D:$D, D193) + COUNTIF(Event9!$D:$D, D193) + COUNTIF(Event10!$D:$D, D193) + COUNTIF(Event11!$D:$D, D193) + COUNTIF(Event12!$D:$D, D193) + COUNTIF(Event13!$D:$D, D193) + COUNTIF(Event14!$D:$D, D193) + COUNTIF(Event15!$D:$D, D193) + COUNTIF(Event16!$D:$D, D193) + COUNTIF(Event17!$D:$D, D193) + COUNTIF(Event18!$D:$D, D193) + COUNTIF(Event19!$D:$D, D193) + COUNTIF(Event20!$D:$D, D193) + COUNTIF(Event21!$D:$D, D193) + COUNTIF(Event22!$D:$D, D193) + COUNTIF(Event23!$D:$D, D193) + COUNTIF(Event24!$D:$D, D193) + COUNTIF(Event25!$D:$D, D193) + 0","v":1},{"$f":"IF(D193=\"\", \"\", IF(IFERROR(VLOOKUP(D193, Dues!D:D, 1, FALSE), \"\")=\"\", \"No\", \"Yes\"))","v":"Yes"},{"$f":"IF(D193=\"\", \"\", IF(IFERROR(VLOOKUP(D193, Interview!D:D, 1, FALSE), \"\")<>\"\", \"Yes\", IF(OR(C193=\"Fr\", C193=\"So\", AND(C193=\"Sr\", TODAY()<43646)), \"N/A\", \"No\")))","v":"N/A"}]
["David","Bromberg","So","dmb6403",{"$f":"COUNTIF(Event1!$D:$D, D194) + COUNTIF(Event2!$D:$D, D194) + COUNTIF(Event3!$D:$D, D194) + COUNTIF(Event4!$D:$D, D194) + COUNTIF(Event5!$D:$D, D194) + COUNTIF(Event6!$D:$D, D194) + COUNTIF(Event7!$D:$D, D194) + COUNTIF(Event8!$D:$D, D194) + COUNTIF(Event9!$D:$D, D194) + COUNTIF(Event10!$D:$D, D194) + COUNTIF(Event11!$D:$D, D194) + COUNTIF(Event12!$D:$D, D194) + COUNTIF(Event13!$D:$D, D194) + COUNTIF(Event14!$D:$D, D194) + COUNTIF(Event15!$D:$D, D194) + COUNTIF(Event16!$D:$D, D194) + COUNTIF(Event17!$D:$D, D194) + COUNTIF(Event18!$D:$D, D194) + COUNTIF(Event19!$D:$D, D194) + COUNTIF(Event20!$D:$D, D194) + COUNTIF(Event21!$D:$D, D194) + COUNTIF(Event22!$D:$D, D194) + COUNTIF(Event23!$D:$D, D194) + COUNTIF(Event24!$D:$D, D194) + COUNTIF(Event25!$D:$D, D194) + 0","v":1},{"$f":"IF(D194=\"\", \"\", IF(IFERROR(VLOOKUP(D194, Dues!D:D, 1, FALSE), \"\")=\"\", \"No\", \"Yes\"))","v":"No"},{"$f":"IF(D194=\"\", \"\", IF(IFERROR(VLOOKUP(D194, Interview!D:D, 1, FALSE), \"\")<>\"\", \"Yes\", IF(OR(C194=\"Fr\", C194=\"So\", AND(C194=\"Sr\", TODAY()<43646)), \"N/A\", \"No\")))","v":"N/A"}]
["Ashley","Kniff","Fr","ank5452",{"$f":"COUNTIF(Event1!$D:$D, D195) + COUNTIF(Event2!$D:$D, D195) + COUNTIF(Event3!$D:$D, D195) + COUNTIF(Event4!$D:$D, D195) + COUNTIF(Event5!$D:$D, D195) + COUNTIF(Event6!$D:$D, D195) + COUNTIF(Event7!$D:$D, D195) + COUNTIF(Event8!$D:$D, D195) + COUNTIF(Event9!$D:$D, D195) + COUNTIF(Event10!$D:$D, D195) + COUNTIF(Event11!$D:$D, D195) + COUNTIF(Event12!$D:$D, D195) + COUNTIF(Event13!$D:$D, D195) + COUNTIF(Event14!$D:$D, D195) + COUNTIF(Event15!$D:$D, D195) + COUNTIF(Event16!$D:$D, D195) + COUNTIF(Event17!$D:$D, D195) + COUNTIF(Event18!$D:$D, D195) + COUNTIF(Event19!$D:$D, D195) + COUNTIF(Event20!$D:$D, D195) + COUNTIF(Event21!$D:$D, D195) + COUNTIF(Event22!$D:$D, D195) + COUNTIF(Event23!$D:$D, D195) + COUNTIF(Event24!$D:$D, D195) + COUNTIF(Event25!$D:$D, D195) + 0","v":1},{"$f":"IF(D195=\"\", \"\", IF(IFERROR(VLOOKUP(D195, Dues!D:D, 1, FALSE), \"\")=\"\", \"No\", \"Yes\"))","v":"No"},{"$f":"IF(D195=\"\", \"\", IF(IFERROR(VLOOKUP(D195, Interview!D:D, 1, FALSE), \"\")<>\"\", \"Yes\", IF(OR(C195=\"Fr\", C195=\"So\", AND(C195=\"Sr\", TODAY()<43646)), \"N/A\", \"No\")))","v":"N/A"}]
["Remington","Harris","Fr","rgh5122",{"$f":"COUNTIF(Event1!$D:$D, D196) + COUNTIF(Event2!$D:$D, D196) + COUNTIF(Event3!$D:$D, D196) + COUNTIF(Event4!$D:$D, D196) + COUNTIF(Event5!$D:$D, D196) + COUNTIF(Event6!$D:$D, D196) + COUNTIF(Event7!$D:$D, D196) + COUNTIF(Event8!$D:$D, D196) + COUNTIF(Event9!$D:$D, D196) + COUNTIF(Event10!$D:$D, D196) + COUNTIF(Event11!$D:$D, D196) + COUNTIF(Event12!$D:$D, D196) + COUNTIF(Event13!$D:$D, D196) + COUNTIF(Event14!$D:$D, D196) + COUNTIF(Event15!$D:$D, D196) + COUNTIF(Event16!$D:$D, D196) + COUNTIF(Event17!$D:$D, D196) + COUNTIF(Event18!$D:$D, D196) + COUNTIF(Event19!$D:$D, D196) + COUNTIF(Event20!$D:$D, D196) + COUNTIF(Event21!$D:$D, D196) + COUNTIF(Event22!$D:$D, D196) + COUNTIF(Event23!$D:$D, D196) + COUNTIF(Event24!$D:$D, D196) + COUNTIF(Event25!$D:$D, D196) + 0","v":1},{"$f":"IF(D196=\"\", \"\", IF(IFERROR(VLOOKUP(D196, Dues!D:D, 1, FALSE), \"\")=\"\", \"No\", \"Yes\"))","v":"No"},{"$f":"IF(D196=\"\", \"\", IF(IFERROR(VLOOKUP(D196, Interview!D:D, 1, FALSE), \"\")<>\"\", \"Yes\", IF(OR(C196=\"Fr\", C196=\"So\", AND(C196=\"Sr\", TODAY()<43646)), \"N/A\", \"No\")))","v":"N/A"}]
["Drew","Insley","Fr","dki5019",{"$f":"COUNTIF(Event1!$D:$D, D197) + COUNTIF(Event2!$D:$D, D197) + COUNTIF(Event3!$D:$D, D197) + COUNTIF(Event4!$D:$D, D197) + COUNTIF(Event5!$D:$D, D197) + COUNTIF(Event6!$D:$D, D197) + COUNTIF(Event7!$D:$D, D197) + COUNTIF(Event8!$D:$D, D197) + COUNTIF(Event9!$D:$D, D197) + COUNTIF(Event10!$D:$D, D197) + COUNTIF(Event11!$D:$D, D197) + COUNTIF(Event12!$D:$D, D197) + COUNTIF(Event13!$D:$D, D197) + COUNTIF(Event14!$D:$D, D197) + COUNTIF(Event15!$D:$D, D197) + COUNTIF(Event16!$D:$D, D197) + COUNTIF(Event17!$D:$D, D197) + COUNTIF(Event18!$D:$D, D197) + COUNTIF(Event19!$D:$D, D197) + COUNTIF(Event20!$D:$D, D197) + COUNTIF(Event21!$D:$D, D197) + COUNTIF(Event22!$D:$D, D197) + COUNTIF(Event23!$D:$D, D197) + COUNTIF(Event24!$D:$D, D197) + COUNTIF(Event25!$D:$D, D197) + 0","v":1},{"$f":"IF(D197=\"\", \"\", IF(IFERROR(VLOOKUP(D197, Dues!D:D, 1, FALSE), \"\")=\"\", \"No\", \"Yes\"))","v":"Yes"},{"$f":"IF(D197=\"\", \"\", IF(IFERROR(VLOOKUP(D197, Interview!D:D, 1, FALSE), \"\")<>\"\", \"Yes\", IF(OR(C197=\"Fr\", C197=\"So\", AND(C197=\"Sr\", TODAY()<43646)), \"N/A\", \"No\")))","v":"N/A"}]
["Brian","Garbacik","Fr","brg16",{"$f":"COUNTIF(Event1!$D:$D, D198) + COUNTIF(Event2!$D:$D, D198) + COUNTIF(Event3!$D:$D, D198) + COUNTIF(Event4!$D:$D, D198) + COUNTIF(Event5!$D:$D, D198) + COUNTIF(Event6!$D:$D, D198) + COUNTIF(Event7!$D:$D, D198) + COUNTIF(Event8!$D:$D, D198) + COUNTIF(Event9!$D:$D, D198) + COUNTIF(Event10!$D:$D, D198) + COUNTIF(Event11!$D:$D, D198) + COUNTIF(Event12!$D:$D, D198) + COUNTIF(Event13!$D:$D, D198) + COUNTIF(Event14!$D:$D, D198) + COUNTIF(Event15!$D:$D, D198) + COUNTIF(Event16!$D:$D, D198) + COUNTIF(Event17!$D:$D, D198) + COUNTIF(Event18!$D:$D, D198) + COUNTIF(Event19!$D:$D, D198) + COUNTIF(Event20!$D:$D, D198) + COUNTIF(Event21!$D:$D, D198) + COUNTIF(Event22!$D:$D, D198) + COUNTIF(Event23!$D:$D, D198) + COUNTIF(Event24!$D:$D, D198) + COUNTIF(Event25!$D:$D, D198) + 0","v":1},{"$f":"IF(D198=\"\", \"\", IF(IFERROR(VLOOKUP(D198, Dues!D:D, 1, FALSE), \"\")=\"\", \"No\", \"Yes\"))","v":"Yes"},{"$f":"IF(D198=\"\", \"\", IF(IFERROR(VLOOKUP(D198, Interview!D:D, 1, FALSE), \"\")<>\"\", \"Yes\", IF(OR(C198=\"Fr\", C198=\"So\", AND(C198=\"Sr\", TODAY()<43646)), \"N/A\", \"No\")))","v":"N/A"}]
["Ethan","Cai","Fr","wvc5264",{"$f":"COUNTIF(Event1!$D:$D, D199) + COUNTIF(Event2!$D:$D, D199) + COUNTIF(Event3!$D:$D, D199) + COUNTIF(Event4!$D:$D, D199) + COUNTIF(Event5!$D:$D, D199) + COUNTIF(Event6!$D:$D, D199) + COUNTIF(Event7!$D:$D, D199) + COUNTIF(Event8!$D:$D, D199) + COUNTIF(Event9!$D:$D, D199) + COUNTIF(Event10!$D:$D, D199) + COUNTIF(Event11!$D:$D, D199) + COUNTIF(Event12!$D:$D, D199) + COUNTIF(Event13!$D:$D, D199) + COUNTIF(Event14!$D:$D, D199) + COUNTIF(Event15!$D:$D, D199) + COUNTIF(Event16!$D:$D, D199) + COUNTIF(Event17!$D:$D, D199) + COUNTIF(Event18!$D:$D, D199) + COUNTIF(Event19!$D:$D, D199) + COUNTIF(Event20!$D:$D, D199) + COUNTIF(Event21!$D:$D, D199) + COUNTIF(Event22!$D:$D, D199) + COUNTIF(Event23!$D:$D, D199) + COUNTIF(Event24!$D:$D, D199) + COUNTIF(Event25!$D:$D, D199) + 0","v":1},{"$f":"IF(D199=\"\", \"\", IF(IFERROR(VLOOKUP(D199, Dues!D:D, 1, FALSE), \"\")=\"\", \"No\", \"Yes\"))","v":"Yes"},{"$f":"IF(D199=\"\", \"\", IF(IFERROR(VLOOKUP(D199, Interview!D:D, 1, FALSE), \"\")<>\"\", \"Yes\", IF(OR(C199=\"Fr\", C199=\"So\", AND(C199=\"Sr\", TODAY()<43646)), \"N/A\", \"No\")))","v":"N/A"}]
["chunxu","wang","Fr","ckw5354",{"$f":"COUNTIF(Event1!$D:$D, D200) + COUNTIF(Event2!$D:$D, D200) + COUNTIF(Event3!$D:$D, D200) + COUNTIF(Event4!$D:$D, D200) + COUNTIF(Event5!$D:$D, D200) + COUNTIF(Event6!$D:$D, D200) + COUNTIF(Event7!$D:$D, D200) + COUNTIF(Event8!$D:$D, D200) + COUNTIF(Event9!$D:$D, D200) + COUNTIF(Event10!$D:$D, D200) + COUNTIF(Event11!$D:$D, D200) + COUNTIF(Event12!$D:$D, D200) + COUNTIF(Event13!$D:$D, D200) + COUNTIF(Event14!$D:$D, D200) + COUNTIF(Event15!$D:$D, D200) + COUNTIF(Event16!$D:$D, D200) + COUNTIF(Event17!$D:$D, D200) + COUNTIF(Event18!$D:$D, D200) + COUNTIF(Event19!$D:$D, D200) + COUNTIF(Event20!$D:$D, D200) + COUNTIF(Event21!$D:$D, D200) + COUNTIF(Event22!$D:$D, D200) + COUNTIF(Event23!$D:$D, D200) + COUNTIF(Event24!$D:$D, D200) + COUNTIF(Event25!$D:$D, D200) + 0","v":1},{"$f":"IF(D200=\"\", \"\", IF(IFERROR(VLOOKUP(D200, Dues!D:D, 1, FALSE), \"\")=\"\", \"No\", \"Yes\"))","v":"Yes"},{"$f":"IF(D200=\"\", \"\", IF(IFERROR(VLOOKUP(D200, Interview!D:D, 1, FALSE), \"\")<>\"\", \"Yes\", IF(OR(C200=\"Fr\", C200=\"So\", AND(C200=\"Sr\", TODAY()<43646)), \"N/A\", \"No\")))","v":"N/A"}]
["Zhaoxin","Liang","Jr","zxl5305",{"$f":"COUNTIF(Event1!$D:$D, D201) + COUNTIF(Event2!$D:$D, D201) + COUNTIF(Event3!$D:$D, D201) + COUNTIF(Event4!$D:$D, D201) + COUNTIF(Event5!$D:$D, D201) + COUNTIF(Event6!$D:$D, D201) + COUNTIF(Event7!$D:$D, D201) + COUNTIF(Event8!$D:$D, D201) + COUNTIF(Event9!$D:$D, D201) + COUNTIF(Event10!$D:$D, D201) + COUNTIF(Event11!$D:$D, D201) + COUNTIF(Event12!$D:$D, D201) + COUNTIF(Event13!$D:$D, D201) + COUNTIF(Event14!$D:$D, D201) + COUNTIF(Event15!$D:$D, D201) + COUNTIF(Event16!$D:$D, D201) + COUNTIF(Event17!$D:$D, D201) + COUNTIF(Event18!$D:$D, D201) + COUNTIF(Event19!$D:$D, D201) + COUNTIF(Event20!$D:$D, D201) + COUNTIF(Event21!$D:$D, D201) + COUNTIF(Event22!$D:$D, D201) + COUNTIF(Event23!$D:$D, D201) + COUNTIF(Event24!$D:$D, D201) + COUNTIF(Event25!$D:$D, D201) + 0","v":1},{"$f":"IF(D201=\"\", \"\", IF(IFERROR(VLOOKUP(D201, Dues!D:D, 1, FALSE), \"\")=\"\", \"No\", \"Yes\"))","v":"No"},{"$f":"IF(D201=\"\", \"\", IF(IFERROR(VLOOKUP(D201, Interview!D:D, 1, FALSE), \"\")<>\"\", \"Yes\", IF(OR(C201=\"Fr\", C201=\"So\", AND(C201=\"Sr\", TODAY()<43646)), \"N/A\", \"No\")))","v":"No"}]
["Blake","Rohrbacher","Jr","bkr5178",{"$f":"COUNTIF(Event1!$D:$D, D202) + COUNTIF(Event2!$D:$D, D202) + COUNTIF(Event3!$D:$D, D202) + COUNTIF(Event4!$D:$D, D202) + COUNTIF(Event5!$D:$D, D202) + COUNTIF(Event6!$D:$D, D202) + COUNTIF(Event7!$D:$D, D202) + COUNTIF(Event8!$D:$D, D202) + COUNTIF(Event9!$D:$D, D202) + COUNTIF(Event10!$D:$D, D202) + COUNTIF(Event11!$D:$D, D202) + COUNTIF(Event12!$D:$D, D202) + COUNTIF(Event13!$D:$D, D202) + COUNTIF(Event14!$D:$D, D202) + COUNTIF(Event15!$D:$D, D202) + COUNTIF(Event16!$D:$D, D202) + COUNTIF(Event17!$D:$D, D202) + COUNTIF(Event18!$D:$D, D202) + COUNTIF(Event19!$D:$D, D202) + COUNTIF(Event20!$D:$D, D202) + COUNTIF(Event21!$D:$D, D202) + COUNTIF(Event22!$D:$D, D202) + COUNTIF(Event23!$D:$D, D202) + COUNTIF(Event24!$D:$D, D202) + COUNTIF(Event25!$D:$D, D202) + 0","v":1},{"$f":"IF(D202=\"\", \"\", IF(IFERROR(VLOOKUP(D202, Dues!D:D, 1, FALSE), \"\")=\"\", \"No\", \"Yes\"))","v":"Yes"},{"$f":"IF(D202=\"\", \"\", IF(IFERROR(VLOOKUP(D202, Interview!D:D, 1, FALSE), \"\")<>\"\", \"Yes\", IF(OR(C202=\"Fr\", C202=\"So\", AND(C202=\"Sr\", TODAY()<43646)), \"N/A\", \"No\")))","v":"Yes"}]
["Bokai","Chen","So","bxc59",{"$f":"COUNTIF(Event1!$D:$D, D203) + COUNTIF(Event2!$D:$D, D203) + COUNTIF(Event3!$D:$D, D203) + COUNTIF(Event4!$D:$D, D203) + COUNTIF(Event5!$D:$D, D203) + COUNTIF(Event6!$D:$D, D203) + COUNTIF(Event7!$D:$D, D203) + COUNTIF(Event8!$D:$D, D203) + COUNTIF(Event9!$D:$D, D203) + COUNTIF(Event10!$D:$D, D203) + COUNTIF(Event11!$D:$D, D203) + COUNTIF(Event12!$D:$D, D203) + COUNTIF(Event13!$D:$D, D203) + COUNTIF(Event14!$D:$D, D203) + COUNTIF(Event15!$D:$D, D203) + COUNTIF(Event16!$D:$D, D203) + COUNTIF(Event17!$D:$D, D203) + COUNTIF(Event18!$D:$D, D203) + COUNTIF(Event19!$D:$D, D203) + COUNTIF(Event20!$D:$D, D203) + COUNTIF(Event21!$D:$D, D203) + COUNTIF(Event22!$D:$D, D203) + COUNTIF(Event23!$D:$D, D203) + COUNTIF(Event24!$D:$D, D203) + COUNTIF(Event25!$D:$D, D203) + 0","v":1},{"$f":"IF(D203=\"\", \"\", IF(IFERROR(VLOOKUP(D203, Dues!D:D, 1, FALSE), \"\")=\"\", \"No\", \"Yes\"))","v":"No"},{"$f":"IF(D203=\"\", \"\", IF(IFERROR(VLOOKUP(D203, Interview!D:D, 1, FALSE), \"\")<>\"\", \"Yes\", IF(OR(C203=\"Fr\", C203=\"So\", AND(C203=\"Sr\", TODAY()<43646)), \"N/A\", \"No\")))","v":"N/A"}]
["Claudia","Jung","Jr","cjj5206",{"$f":"COUNTIF(Event1!$D:$D, D204) + COUNTIF(Event2!$D:$D, D204) + COUNTIF(Event3!$D:$D, D204) + COUNTIF(Event4!$D:$D, D204) + COUNTIF(Event5!$D:$D, D204) + COUNTIF(Event6!$D:$D, D204) + COUNTIF(Event7!$D:$D, D204) + COUNTIF(Event8!$D:$D, D204) + COUNTIF(Event9!$D:$D, D204) + COUNTIF(Event10!$D:$D, D204) + COUNTIF(Event11!$D:$D, D204) + COUNTIF(Event12!$D:$D, D204) + COUNTIF(Event13!$D:$D, D204) + COUNTIF(Event14!$D:$D, D204) + COUNTIF(Event15!$D:$D, D204) + COUNTIF(Event16!$D:$D, D204) + COUNTIF(Event17!$D:$D, D204) + COUNTIF(Event18!$D:$D, D204) + COUNTIF(Event19!$D:$D, D204) + COUNTIF(Event20!$D:$D, D204) + COUNTIF(Event21!$D:$D, D204) + COUNTIF(Event22!$D:$D, D204) + COUNTIF(Event23!$D:$D, D204) + COUNTIF(Event24!$D:$D, D204) + COUNTIF(Event25!$D:$D, D204) + 0","v":1},{"$f":"IF(D204=\"\", \"\", IF(IFERROR(VLOOKUP(D204, Dues!D:D, 1, FALSE), \"\")=\"\", \"No\", \"Yes\"))","v":"Yes"},{"$f":"IF(D204=\"\", \"\", IF(IFERROR(VLOOKUP(D204, Interview!D:D, 1, FALSE), \"\")<>\"\", \"Yes\", IF(OR(C204=\"Fr\", C204=\"So\", AND(C204=\"Sr\", TODAY()<43646)), \"N/A\", \"No\")))","v":"Yes"}]
["Will ","Stephens ","Fr","whs5100",{"$f":"COUNTIF(Event1!$D:$D, D205) + COUNTIF(Event2!$D:$D, D205) + COUNTIF(Event3!$D:$D, D205) + COUNTIF(Event4!$D:$D, D205) + COUNTIF(Event5!$D:$D, D205) + COUNTIF(Event6!$D:$D, D205) + COUNTIF(Event7!$D:$D, D205) + COUNTIF(Event8!$D:$D, D205) + COUNTIF(Event9!$D:$D, D205) + COUNTIF(Event10!$D:$D, D205) + COUNTIF(Event11!$D:$D, D205) + COUNTIF(Event12!$D:$D, D205) + COUNTIF(Event13!$D:$D, D205) + COUNTIF(Event14!$D:$D, D205) + COUNTIF(Event15!$D:$D, D205) + COUNTIF(Event16!$D:$D, D205) + COUNTIF(Event17!$D:$D, D205) + COUNTIF(Event18!$D:$D, D205) + COUNTIF(Event19!$D:$D, D205) + COUNTIF(Event20!$D:$D, D205) + COUNTIF(Event21!$D:$D, D205) + COUNTIF(Event22!$D:$D, D205) + COUNTIF(Event23!$D:$D, D205) + COUNTIF(Event24!$D:$D, D205) + COUNTIF(Event25!$D:$D, D205) + 0","v":1},{"$f":"IF(D205=\"\", \"\", IF(IFERROR(VLOOKUP(D205, Dues!D:D, 1, FALSE), \"\")=\"\", \"No\", \"Yes\"))","v":"Yes"},{"$f":"IF(D205=\"\", \"\", IF(IFERROR(VLOOKUP(D205, Interview!D:D, 1, FALSE), \"\")<>\"\", \"Yes\", IF(OR(C205=\"Fr\", C205=\"So\", AND(C205=\"Sr\", TODAY()<43646)), \"N/A\", \"No\")))","v":"N/A"}]
["Jeremy","Pritts","Jr","jrp5836",{"$f":"COUNTIF(Event1!$D:$D, D206) + COUNTIF(Event2!$D:$D, D206) + COUNTIF(Event3!$D:$D, D206) + COUNTIF(Event4!$D:$D, D206) + COUNTIF(Event5!$D:$D, D206) + COUNTIF(Event6!$D:$D, D206) + COUNTIF(Event7!$D:$D, D206) + COUNTIF(Event8!$D:$D, D206) + COUNTIF(Event9!$D:$D, D206) + COUNTIF(Event10!$D:$D, D206) + COUNTIF(Event11!$D:$D, D206) + COUNTIF(Event12!$D:$D, D206) + COUNTIF(Event13!$D:$D, D206) + COUNTIF(Event14!$D:$D, D206) + COUNTIF(Event15!$D:$D, D206) + COUNTIF(Event16!$D:$D, D206) + COUNTIF(Event17!$D:$D, D206) + COUNTIF(Event18!$D:$D, D206) + COUNTIF(Event19!$D:$D, D206) + COUNTIF(Event20!$D:$D, D206) + COUNTIF(Event21!$D:$D, D206) + COUNTIF(Event22!$D:$D, D206) + COUNTIF(Event23!$D:$D, D206) + COUNTIF(Event24!$D:$D, D206) + COUNTIF(Event25!$D:$D, D206) + 0","v":1},{"$f":"IF(D206=\"\", \"\", IF(IFERROR(VLOOKUP(D206, Dues!D:D, 1, FALSE), \"\")=\"\", \"No\", \"Yes\"))","v":"No"},{"$f":"IF(D206=\"\", \"\", IF(IFERROR(VLOOKUP(D206, Interview!D:D, 1, FALSE), \"\")<>\"\", \"Yes\", IF(OR(C206=\"Fr\", C206=\"So\", AND(C206=\"Sr\", TODAY()<43646)), \"N/A\", \"No\")))","v":"No"}]
["Xiaohan","Cai","Jr","xzc5175",{"$f":"COUNTIF(Event1!$D:$D, D207) + COUNTIF(Event2!$D:$D, D207) + COUNTIF(Event3!$D:$D, D207) + COUNTIF(Event4!$D:$D, D207) + COUNTIF(Event5!$D:$D, D207) + COUNTIF(Event6!$D:$D, D207) + COUNTIF(Event7!$D:$D, D207) + COUNTIF(Event8!$D:$D, D207) + COUNTIF(Event9!$D:$D, D207) + COUNTIF(Event10!$D:$D, D207) + COUNTIF(Event11!$D:$D, D207) + COUNTIF(Event12!$D:$D, D207) + COUNTIF(Event13!$D:$D, D207) + COUNTIF(Event14!$D:$D, D207) + COUNTIF(Event15!$D:$D, D207) + COUNTIF(Event16!$D:$D, D207) + COUNTIF(Event17!$D:$D, D207) + COUNTIF(Event18!$D:$D, D207) + COUNTIF(Event19!$D:$D, D207) + COUNTIF(Event20!$D:$D, D207) + COUNTIF(Event21!$D:$D, D207) + COUNTIF(Event22!$D:$D, D207) + COUNTIF(Event23!$D:$D, D207) + COUNTIF(Event24!$D:$D, D207) + COUNTIF(Event25!$D:$D, D207) + 0","v":1},{"$f":"IF(D207=\"\", \"\", IF(IFERROR(VLOOKUP(D207, Dues!D:D, 1, FALSE), \"\")=\"\", \"No\", \"Yes\"))","v":"No"},{"$f":"IF(D207=\"\", \"\", IF(IFERROR(VLOOKUP(D207, Interview!D:D, 1, FALSE), \"\")<>\"\", \"Yes\", IF(OR(C207=\"Fr\", C207=\"So\", AND(C207=\"Sr\", TODAY()<43646)), \"N/A\", \"No\")))","v":"No"}]
["Ziling","zhang","Jr","zmz5078",{"$f":"COUNTIF(Event1!$D:$D, D208) + COUNTIF(Event2!$D:$D, D208) + COUNTIF(Event3!$D:$D, D208) + COUNTIF(Event4!$D:$D, D208) + COUNTIF(Event5!$D:$D, D208) + COUNTIF(Event6!$D:$D, D208) + COUNTIF(Event7!$D:$D, D208) + COUNTIF(Event8!$D:$D, D208) + COUNTIF(Event9!$D:$D, D208) + COUNTIF(Event10!$D:$D, D208) + COUNTIF(Event11!$D:$D, D208) + COUNTIF(Event12!$D:$D, D208) + COUNTIF(Event13!$D:$D, D208) + COUNTIF(Event14!$D:$D, D208) + COUNTIF(Event15!$D:$D, D208) + COUNTIF(Event16!$D:$D, D208) + COUNTIF(Event17!$D:$D, D208) + COUNTIF(Event18!$D:$D, D208) + COUNTIF(Event19!$D:$D, D208) + COUNTIF(Event20!$D:$D, D208) + COUNTIF(Event21!$D:$D, D208) + COUNTIF(Event22!$D:$D, D208) + COUNTIF(Event23!$D:$D, D208) + COUNTIF(Event24!$D:$D, D208) + COUNTIF(Event25!$D:$D, D208) + 0","v":1},{"$f":"IF(D208=\"\", \"\", IF(IFERROR(VLOOKUP(D208, Dues!D:D, 1, FALSE), \"\")=\"\", \"No\", \"Yes\"))","v":"No"},{"$f":"IF(D208=\"\", \"\", IF(IFERROR(VLOOKUP(D208, Interview!D:D, 1, FALSE), \"\")<>\"\", \"Yes\", IF(OR(C208=\"Fr\", C208=\"So\", AND(C208=\"Sr\", TODAY()<43646)), \"N/A\", \"No\")))","v":"No"}]
["Juliette","van Schaik","Jr","jiv5171",{"$f":"COUNTIF(Event1!$D:$D, D209) + COUNTIF(Event2!$D:$D, D209) + COUNTIF(Event3!$D:$D, D209) + COUNTIF(Event4!$D:$D, D209) + COUNTIF(Event5!$D:$D, D209) + COUNTIF(Event6!$D:$D, D209) + COUNTIF(Event7!$D:$D, D209) + COUNTIF(Event8!$D:$D, D209) + COUNTIF(Event9!$D:$D, D209) + COUNTIF(Event10!$D:$D, D209) + COUNTIF(Event11!$D:$D, D209) + COUNTIF(Event12!$D:$D, D209) + COUNTIF(Event13!$D:$D, D209) + COUNTIF(Event14!$D:$D, D209) + COUNTIF(Event15!$D:$D, D209) + COUNTIF(Event16!$D:$D, D209) + COUNTIF(Event17!$D:$D, D209) + COUNTIF(Event18!$D:$D, D209) + COUNTIF(Event19!$D:$D, D209) + COUNTIF(Event20!$D:$D, D209) + COUNTIF(Event21!$D:$D, D209) + COUNTIF(Event22!$D:$D, D209) + COUNTIF(Event23!$D:$D, D209) + COUNTIF(Event24!$D:$D, D209) + COUNTIF(Event25!$D:$D, D209) + 0","v":1},{"$f":"IF(D209=\"\", \"\", IF(IFERROR(VLOOKUP(D209, Dues!D:D, 1, FALSE), \"\")=\"\", \"No\", \"Yes\"))","v":"Yes"},{"$f":"IF(D209=\"\", \"\", IF(IFERROR(VLOOKUP(D209, Interview!D:D, 1, FALSE), \"\")<>\"\", \"Yes\", IF(OR(C209=\"Fr\", C209=\"So\", AND(C209=\"Sr\", TODAY()<43646)), \"N/A\", \"No\")))","v":"Yes"}]
["Evan","Rerecich","Sr","emr5498",{"$f":"COUNTIF(Event1!$D:$D, D210) + COUNTIF(Event2!$D:$D, D210) + COUNTIF(Event3!$D:$D, D210) + COUNTIF(Event4!$D:$D, D210) + COUNTIF(Event5!$D:$D, D210) + COUNTIF(Event6!$D:$D, D210) + COUNTIF(Event7!$D:$D, D210) + COUNTIF(Event8!$D:$D, D210) + COUNTIF(Event9!$D:$D, D210) + COUNTIF(Event10!$D:$D, D210) + COUNTIF(Event11!$D:$D, D210) + COUNTIF(Event12!$D:$D, D210) + COUNTIF(Event13!$D:$D, D210) + COUNTIF(Event14!$D:$D, D210) + COUNTIF(Event15!$D:$D, D210) + COUNTIF(Event16!$D:$D, D210) + COUNTIF(Event17!$D:$D, D210) + COUNTIF(Event18!$D:$D, D210) + COUNTIF(Event19!$D:$D, D210) + COUNTIF(Event20!$D:$D, D210) + COUNTIF(Event21!$D:$D, D210) + COUNTIF(Event22!$D:$D, D210) + COUNTIF(Event23!$D:$D, D210) + COUNTIF(Event24!$D:$D, D210) + COUNTIF(Event25!$D:$D, D210) + 0","v":1},{"$f":"IF(D210=\"\", \"\", IF(IFERROR(VLOOKUP(D210, Dues!D:D, 1, FALSE), \"\")=\"\", \"No\", \"Yes\"))","v":"Yes"},{"$f":"IF(D210=\"\", \"\", IF(IFERROR(VLOOKUP(D210, Interview!D:D, 1, FALSE), \"\")<>\"\", \"Yes\", IF(OR(C210=\"Fr\", C210=\"So\", AND(C210=\"Sr\", TODAY()<43646)), \"N/A\", \"No\")))","v":"N/A"}]
["Jingzhe","Han","Jr","jjh6271",{"$f":"COUNTIF(Event1!$D:$D, D211) + COUNTIF(Event2!$D:$D, D211) + COUNTIF(Event3!$D:$D, D211) + COUNTIF(Event4!$D:$D, D211) + COUNTIF(Event5!$D:$D, D211) + COUNTIF(Event6!$D:$D, D211) + COUNTIF(Event7!$D:$D, D211) + COUNTIF(Event8!$D:$D, D211) + COUNTIF(Event9!$D:$D, D211) + COUNTIF(Event10!$D:$D, D211) + COUNTIF(Event11!$D:$D, D211) + COUNTIF(Event12!$D:$D, D211) + COUNTIF(Event13!$D:$D, D211) + COUNTIF(Event14!$D:$D, D211) + COUNTIF(Event15!$D:$D, D211) + COUNTIF(Event16!$D:$D, D211) + COUNTIF(Event17!$D:$D, D211) + COUNTIF(Event18!$D:$D, D211) + COUNTIF(Event19!$D:$D, D211) + COUNTIF(Event20!$D:$D, D211) + COUNTIF(Event21!$D:$D, D211) + COUNTIF(Event22!$D:$D, D211) + COUNTIF(Event23!$D:$D, D211) + COUNTIF(Event24!$D:$D, D211) + COUNTIF(Event25!$D:$D, D211) + 0","v":1},{"$f":"IF(D211=\"\", \"\", IF(IFERROR(VLOOKUP(D211, Dues!D:D, 1, FALSE), \"\")=\"\", \"No\", \"Yes\"))","v":"No"},{"$f":"IF(D211=\"\", \"\", IF(IFERROR(VLOOKUP(D211, Interview!D:D, 1, FALSE), \"\")<>\"\", \"Yes\", IF(OR(C211=\"Fr\", C211=\"So\", AND(C211=\"Sr\", TODAY()<43646)), \"N/A\", \"No\")))","v":"No"}]
["Liam","Richards","Sr","lrr5177",{"$f":"COUNTIF(Event1!$D:$D, D212) + COUNTIF(Event2!$D:$D, D212) + COUNTIF(Event3!$D:$D, D212) + COUNTIF(Event4!$D:$D, D212) + COUNTIF(Event5!$D:$D, D212) + COUNTIF(Event6!$D:$D, D212) + COUNTIF(Event7!$D:$D, D212) + COUNTIF(Event8!$D:$D, D212) + COUNTIF(Event9!$D:$D, D212) + COUNTIF(Event10!$D:$D, D212) + COUNTIF(Event11!$D:$D, D212) + COUNTIF(Event12!$D:$D, D212) + COUNTIF(Event13!$D:$D, D212) + COUNTIF(Event14!$D:$D, D212) + COUNTIF(Event15!$D:$D, D212) + COUNTIF(Event16!$D:$D, D212) + COUNTIF(Event17!$D:$D, D212) + COUNTIF(Event18!$D:$D, D212) + COUNTIF(Event19!$D:$D, D212) + COUNTIF(Event20!$D:$D, D212) + COUNTIF(Event21!$D:$D, D212) + COUNTIF(Event22!$D:$D, D212) + COUNTIF(Event23!$D:$D, D212) + COUNTIF(Event24!$D:$D, D212) + COUNTIF(Event25!$D:$D, D212) + 0","v":1},{"$f":"IF(D212=\"\", \"\", IF(IFERROR(VLOOKUP(D212, Dues!D:D, 1, FALSE), \"\")=\"\", \"No\", \"Yes\"))","v":"Yes"},{"$f":"IF(D212=\"\", \"\", IF(IFERROR(VLOOKUP(D212, Interview!D:D, 1, FALSE), \"\")<>\"\", \"Yes\", IF(OR(C212=\"Fr\", C212=\"So\", AND(C212=\"Sr\", TODAY()<43646)), \"N/A\", \"No\")))","v":"N/A"}]
["Joshua ","Williams","Jr","jkw5499",{"$f":"COUNTIF(Event1!$D:$D, D213) + COUNTIF(Event2!$D:$D, D213) + COUNTIF(Event3!$D:$D, D213) + COUNTIF(Event4!$D:$D, D213) + COUNTIF(Event5!$D:$D, D213) + COUNTIF(Event6!$D:$D, D213) + COUNTIF(Event7!$D:$D, D213) + COUNTIF(Event8!$D:$D, D213) + COUNTIF(Event9!$D:$D, D213) + COUNTIF(Event10!$D:$D, D213) + COUNTIF(Event11!$D:$D, D213) + COUNTIF(Event12!$D:$D, D213) + COUNTIF(Event13!$D:$D, D213) + COUNTIF(Event14!$D:$D, D213) + COUNTIF(Event15!$D:$D, D213) + COUNTIF(Event16!$D:$D, D213) + COUNTIF(Event17!$D:$D, D213) + COUNTIF(Event18!$D:$D, D213) + COUNTIF(Event19!$D:$D, D213) + COUNTIF(Event20!$D:$D, D213) + COUNTIF(Event21!$D:$D, D213) + COUNTIF(Event22!$D:$D, D213) + COUNTIF(Event23!$D:$D, D213) + COUNTIF(Event24!$D:$D, D213) + COUNTIF(Event25!$D:$D, D213) + 0","v":1},{"$f":"IF(D213=\"\", \"\", IF(IFERROR(VLOOKUP(D213, Dues!D:D, 1, FALSE), \"\")=\"\", \"No\", \"Yes\"))","v":"No"},{"$f":"IF(D213=\"\", \"\", IF(IFERROR(VLOOKUP(D213, Interview!D:D, 1, FALSE), \"\")<>\"\", \"Yes\", IF(OR(C213=\"Fr\", C213=\"So\", AND(C213=\"Sr\", TODAY()<43646)), \"N/A\", \"No\")))","v":"No"}]
["Joe","Sukunda","Sr","jhs5235",{"$f":"COUNTIF(Event1!$D:$D, D214) + COUNTIF(Event2!$D:$D, D214) + COUNTIF(Event3!$D:$D, D214) + COUNTIF(Event4!$D:$D, D214) + COUNTIF(Event5!$D:$D, D214) + COUNTIF(Event6!$D:$D, D214) + COUNTIF(Event7!$D:$D, D214) + COUNTIF(Event8!$D:$D, D214) + COUNTIF(Event9!$D:$D, D214) + COUNTIF(Event10!$D:$D, D214) + COUNTIF(Event11!$D:$D, D214) + COUNTIF(Event12!$D:$D, D214) + COUNTIF(Event13!$D:$D, D214) + COUNTIF(Event14!$D:$D, D214) + COUNTIF(Event15!$D:$D, D214) + COUNTIF(Event16!$D:$D, D214) + COUNTIF(Event17!$D:$D, D214) + COUNTIF(Event18!$D:$D, D214) + COUNTIF(Event19!$D:$D, D214) + COUNTIF(Event20!$D:$D, D214) + COUNTIF(Event21!$D:$D, D214) + COUNTIF(Event22!$D:$D, D214) + COUNTIF(Event23!$D:$D, D214) + COUNTIF(Event24!$D:$D, D214) + COUNTIF(Event25!$D:$D, D214) + 0","v":1},{"$f":"IF(D214=\"\", \"\", IF(IFERROR(VLOOKUP(D214, Dues!D:D, 1, FALSE), \"\")=\"\", \"No\", \"Yes\"))","v":"No"},{"$f":"IF(D214=\"\", \"\", IF(IFERROR(VLOOKUP(D214, Interview!D:D, 1, FALSE), \"\")<>\"\", \"Yes\", IF(OR(C214=\"Fr\", C214=\"So\", AND(C214=\"Sr\", TODAY()<43646)), \"N/A\", \"No\")))","v":"N/A"}]
["Mike","Deo","Fr","mqd5586",{"$f":"COUNTIF(Event1!$D:$D, D215) + COUNTIF(Event2!$D:$D, D215) + COUNTIF(Event3!$D:$D, D215) + COUNTIF(Event4!$D:$D, D215) + COUNTIF(Event5!$D:$D, D215) + COUNTIF(Event6!$D:$D, D215) + COUNTIF(Event7!$D:$D, D215) + COUNTIF(Event8!$D:$D, D215) + COUNTIF(Event9!$D:$D, D215) + COUNTIF(Event10!$D:$D, D215) + COUNTIF(Event11!$D:$D, D215) + COUNTIF(Event12!$D:$D, D215) + COUNTIF(Event13!$D:$D, D215) + COUNTIF(Event14!$D:$D, D215) + COUNTIF(Event15!$D:$D, D215) + COUNTIF(Event16!$D:$D, D215) + COUNTIF(Event17!$D:$D, D215) + COUNTIF(Event18!$D:$D, D215) + COUNTIF(Event19!$D:$D, D215) + COUNTIF(Event20!$D:$D, D215) + COUNTIF(Event21!$D:$D, D215) + COUNTIF(Event22!$D:$D, D215) + COUNTIF(Event23!$D:$D, D215) + COUNTIF(Event24!$D:$D, D215) + COUNTIF(Event25!$D:$D, D215) + 0","v":1},{"$f":"IF(D215=\"\", \"\", IF(IFERROR(VLOOKUP(D215, Dues!D:D, 1, FALSE), \"\")=\"\", \"No\", \"Yes\"))","v":"No"},{"$f":"IF(D215=\"\", \"\", IF(IFERROR(VLOOKUP(D215, Interview!D:D, 1, FALSE), \"\")<>\"\", \"Yes\", IF(OR(C215=\"Fr\", C215=\"So\", AND(C215=\"Sr\", TODAY()<43646)), \"N/A\", \"No\")))","v":"N/A"}]
["Tamesha","Harris","Jr","tqh5336",{"$f":"COUNTIF(Event1!$D:$D, D216) + COUNTIF(Event2!$D:$D, D216) + COUNTIF(Event3!$D:$D, D216) + COUNTIF(Event4!$D:$D, D216) + COUNTIF(Event5!$D:$D, D216) + COUNTIF(Event6!$D:$D, D216) + COUNTIF(Event7!$D:$D, D216) + COUNTIF(Event8!$D:$D, D216) + COUNTIF(Event9!$D:$D, D216) + COUNTIF(Event10!$D:$D, D216) + COUNTIF(Event11!$D:$D, D216) + COUNTIF(Event12!$D:$D, D216) + COUNTIF(Event13!$D:$D, D216) + COUNTIF(Event14!$D:$D, D216) + COUNTIF(Event15!$D:$D, D216) + COUNTIF(Event16!$D:$D, D216) + COUNTIF(Event17!$D:$D, D216) + COUNTIF(Event18!$D:$D, D216) + COUNTIF(Event19!$D:$D, D216) + COUNTIF(Event20!$D:$D, D216) + COUNTIF(Event21!$D:$D, D216) + COUNTIF(Event22!$D:$D, D216) + COUNTIF(Event23!$D:$D, D216) + COUNTIF(Event24!$D:$D, D216) + COUNTIF(Event25!$D:$D, D216) + 0","v":1},{"$f":"IF(D216=\"\", \"\", IF(IFERROR(VLOOKUP(D216, Dues!D:D, 1, FALSE), \"\")=\"\", \"No\", \"Yes\"))","v":"No"},{"$f":"IF(D216=\"\", \"\", IF(IFERROR(VLOOKUP(D216, Interview!D:D, 1, FALSE), \"\")<>\"\", \"Yes\", IF(OR(C216=\"Fr\", C216=\"So\", AND(C216=\"Sr\", TODAY()<43646)), \"N/A\", \"No\")))","v":"No"}]
["Olivia","Dalby","Jr","opd5013",{"$f":"COUNTIF(Event1!$D:$D, D217) + COUNTIF(Event2!$D:$D, D217) + COUNTIF(Event3!$D:$D, D217) + COUNTIF(Event4!$D:$D, D217) + COUNTIF(Event5!$D:$D, D217) + COUNTIF(Event6!$D:$D, D217) + COUNTIF(Event7!$D:$D, D217) + COUNTIF(Event8!$D:$D, D217) + COUNTIF(Event9!$D:$D, D217) + COUNTIF(Event10!$D:$D, D217) + COUNTIF(Event11!$D:$D, D217) + COUNTIF(Event12!$D:$D, D217) + COUNTIF(Event13!$D:$D, D217) + COUNTIF(Event14!$D:$D, D217) + COUNTIF(Event15!$D:$D, D217) + COUNTIF(Event16!$D:$D, D217) + COUNTIF(Event17!$D:$D, D217) + COUNTIF(Event18!$D:$D, D217) + COUNTIF(Event19!$D:$D, D217) + COUNTIF(Event20!$D:$D, D217) + COUNTIF(Event21!$D:$D, D217) + COUNTIF(Event22!$D:$D, D217) + COUNTIF(Event23!$D:$D, D217) + COUNTIF(Event24!$D:$D, D217) + COUNTIF(Event25!$D:$D, D217) + 0","v":1},{"$f":"IF(D217=\"\", \"\", IF(IFERROR(VLOOKUP(D217, Dues!D:D, 1, FALSE), \"\")=\"\", \"No\", \"Yes\"))","v":"No"},{"$f":"IF(D217=\"\", \"\", IF(IFERROR(VLOOKUP(D217, Interview!D:D, 1, FALSE), \"\")<>\"\", \"Yes\", IF(OR(C217=\"Fr\", C217=\"So\", AND(C217=\"Sr\", TODAY()<43646)), \"N/A\", \"No\")))","v":"Yes"}]
["Bingxin","Liu","Fr","bzl95",{"$f":"COUNTIF(Event1!$D:$D, D218) + COUNTIF(Event2!$D:$D, D218) + COUNTIF(Event3!$D:$D, D218) + COUNTIF(Event4!$D:$D, D218) + COUNTIF(Event5!$D:$D, D218) + COUNTIF(Event6!$D:$D, D218) + COUNTIF(Event7!$D:$D, D218) + COUNTIF(Event8!$D:$D, D218) + COUNTIF(Event9!$D:$D, D218) + COUNTIF(Event10!$D:$D, D218) + COUNTIF(Event11!$D:$D, D218) + COUNTIF(Event12!$D:$D, D218) + COUNTIF(Event13!$D:$D, D218) + COUNTIF(Event14!$D:$D, D218) + COUNTIF(Event15!$D:$D, D218) + COUNTIF(Event16!$D:$D, D218) + COUNTIF(Event17!$D:$D, D218) + COUNTIF(Event18!$D:$D, D218) + COUNTIF(Event19!$D:$D, D218) + COUNTIF(Event20!$D:$D, D218) + COUNTIF(Event21!$D:$D, D218) + COUNTIF(Event22!$D:$D, D218) + COUNTIF(Event23!$D:$D, D218) + COUNTIF(Event24!$D:$D, D218) + COUNTIF(Event25!$D:$D, D218) + 0","v":1},{"$f":"IF(D218=\"\", \"\", IF(IFERROR(VLOOKUP(D218, Dues!D:D, 1, FALSE), \"\")=\"\", \"No\", \"Yes\"))","v":"No"},{"$f":"IF(D218=\"\", \"\", IF(IFERROR(VLOOKUP(D218, Interview!D:D, 1, FALSE), \"\")<>\"\", \"Yes\", IF(OR(C218=\"Fr\", C218=\"So\", AND(C218=\"Sr\", TODAY()<43646)), \"N/A\", \"No\")))","v":"N/A"}]
["Yousef","Jubran","Sr","ynj5007",{"$f":"COUNTIF(Event1!$D:$D, D219) + COUNTIF(Event2!$D:$D, D219) + COUNTIF(Event3!$D:$D, D219) + COUNTIF(Event4!$D:$D, D219) + COUNTIF(Event5!$D:$D, D219) + COUNTIF(Event6!$D:$D, D219) + COUNTIF(Event7!$D:$D, D219) + COUNTIF(Event8!$D:$D, D219) + COUNTIF(Event9!$D:$D, D219) + COUNTIF(Event10!$D:$D, D219) + COUNTIF(Event11!$D:$D, D219) + COUNTIF(Event12!$D:$D, D219) + COUNTIF(Event13!$D:$D, D219) + COUNTIF(Event14!$D:$D, D219) + COUNTIF(Event15!$D:$D, D219) + COUNTIF(Event16!$D:$D, D219) + COUNTIF(Event17!$D:$D, D219) + COUNTIF(Event18!$D:$D, D219) + COUNTIF(Event19!$D:$D, D219) + COUNTIF(Event20!$D:$D, D219) + COUNTIF(Event21!$D:$D, D219) + COUNTIF(Event22!$D:$D, D219) + COUNTIF(Event23!$D:$D, D219) + COUNTIF(Event24!$D:$D, D219) + COUNTIF(Event25!$D:$D, D219) + 0","v":1},{"$f":"IF(D219=\"\", \"\", IF(IFERROR(VLOOKUP(D219, Dues!D:D, 1, FALSE), \"\")=\"\", \"No\", \"Yes\"))","v":"No"},{"$f":"IF(D219=\"\", \"\", IF(IFERROR(VLOOKUP(D219, Interview!D:D, 1, FALSE), \"\")<>\"\", \"Yes\", IF(OR(C219=\"Fr\", C219=\"So\", AND(C219=\"Sr\", TODAY()<43646)), \"N/A\", \"No\")))","v":"N/A"}]
["Rafael","Bergerman","Sr","rmb5769",{"$f":"COUNTIF(Event1!$D:$D, D220) + COUNTIF(Event2!$D:$D, D220) + COUNTIF(Event3!$D:$D, D220) + COUNTIF(Event4!$D:$D, D220) + COUNTIF(Event5!$D:$D, D220) + COUNTIF(Event6!$D:$D, D220) + COUNTIF(Event7!$D:$D, D220) + COUNTIF(Event8!$D:$D, D220) + COUNTIF(Event9!$D:$D, D220) + COUNTIF(Event10!$D:$D, D220) + COUNTIF(Event11!$D:$D, D220) + COUNTIF(Event12!$D:$D, D220) + COUNTIF(Event13!$D:$D, D220) + COUNTIF(Event14!$D:$D, D220) + COUNTIF(Event15!$D:$D, D220) + COUNTIF(Event16!$D:$D, D220) + COUNTIF(Event17!$D:$D, D220) + COUNTIF(Event18!$D:$D, D220) + COUNTIF(Event19!$D:$D, D220) + COUNTIF(Event20!$D:$D, D220) + COUNTIF(Event21!$D:$D, D220) + COUNTIF(Event22!$D:$D, D220) + COUNTIF(Event23!$D:$D, D220) + COUNTIF(Event24!$D:$D, D220) + COUNTIF(Event25!$D:$D, D220) + 0","v":1},{"$f":"IF(D220=\"\", \"\", IF(IFERROR(VLOOKUP(D220, Dues!D:D, 1, FALSE), \"\")=\"\", \"No\", \"Yes\"))","v":"No"},{"$f":"IF(D220=\"\", \"\", IF(IFERROR(VLOOKUP(D220, Interview!D:D, 1, FALSE), \"\")<>\"\", \"Yes\", IF(OR(C220=\"Fr\", C220=\"So\", AND(C220=\"Sr\", TODAY()<43646)), \"N/A\", \"No\")))","v":"N/A"}]
["Tianheng","Huang","Sr","txh5267",{"$f":"COUNTIF(Event1!$D:$D, D221) + COUNTIF(Event2!$D:$D, D221) + COUNTIF(Event3!$D:$D, D221) + COUNTIF(Event4!$D:$D, D221) + COUNTIF(Event5!$D:$D, D221) + COUNTIF(Event6!$D:$D, D221) + COUNTIF(Event7!$D:$D, D221) + COUNTIF(Event8!$D:$D, D221) + COUNTIF(Event9!$D:$D, D221) + COUNTIF(Event10!$D:$D, D221) + COUNTIF(Event11!$D:$D, D221) + COUNTIF(Event12!$D:$D, D221) + COUNTIF(Event13!$D:$D, D221) + COUNTIF(Event14!$D:$D, D221) + COUNTIF(Event15!$D:$D, D221) + COUNTIF(Event16!$D:$D, D221) + COUNTIF(Event17!$D:$D, D221) + COUNTIF(Event18!$D:$D, D221) + COUNTIF(Event19!$D:$D, D221) + COUNTIF(Event20!$D:$D, D221) + COUNTIF(Event21!$D:$D, D221) + COUNTIF(Event22!$D:$D, D221) + COUNTIF(Event23!$D:$D, D221) + COUNTIF(Event24!$D:$D, D221) + COUNTIF(Event25!$D:$D, D221) + 0","v":1},{"$f":"IF(D221=\"\", \"\", IF(IFERROR(VLOOKUP(D221, Dues!D:D, 1, FALSE), \"\")=\"\", \"No\", \"Yes\"))","v":"No"},{"$f":"IF(D221=\"\", \"\", IF(IFERROR(VLOOKUP(D221, Interview!D:D, 1, FALSE), \"\")<>\"\", \"Yes\", IF(OR(C221=\"Fr\", C221=\"So\", AND(C221=\"Sr\", TODAY()<43646)), \"N/A\", \"No\")))","v":"N/A"}]
["Noah","Blake","Sr","nrb5272",{"$f":"COUNTIF(Event1!$D:$D, D222) + COUNTIF(Event2!$D:$D, D222) + COUNTIF(Event3!$D:$D, D222) + COUNTIF(Event4!$D:$D, D222) + COUNTIF(Event5!$D:$D, D222) + COUNTIF(Event6!$D:$D, D222) + COUNTIF(Event7!$D:$D, D222) + COUNTIF(Event8!$D:$D, D222) + COUNTIF(Event9!$D:$D, D222) + COUNTIF(Event10!$D:$D, D222) + COUNTIF(Event11!$D:$D, D222) + COUNTIF(Event12!$D:$D, D222) + COUNTIF(Event13!$D:$D, D222) + COUNTIF(Event14!$D:$D, D222) + COUNTIF(Event15!$D:$D, D222) + COUNTIF(Event16!$D:$D, D222) + COUNTIF(Event17!$D:$D, D222) + COUNTIF(Event18!$D:$D, D222) + COUNTIF(Event19!$D:$D, D222) + COUNTIF(Event20!$D:$D, D222) + COUNTIF(Event21!$D:$D, D222) + COUNTIF(Event22!$D:$D, D222) + COUNTIF(Event23!$D:$D, D222) + COUNTIF(Event24!$D:$D, D222) + COUNTIF(Event25!$D:$D, D222) + 0","v":1},{"$f":"IF(D222=\"\", \"\", IF(IFERROR(VLOOKUP(D222, Dues!D:D, 1, FALSE), \"\")=\"\", \"No\", \"Yes\"))","v":"No"},{"$f":"IF(D222=\"\", \"\", IF(IFERROR(VLOOKUP(D222, Interview!D:D, 1, FALSE), \"\")<>\"\", \"Yes\", IF(OR(C222=\"Fr\", C222=\"So\", AND(C222=\"Sr\", TODAY()<43646)), \"N/A\", \"No\")))","v":"N/A"}]
["Valentina","Miroshevskaia","Sr","vvm5126",{"$f":"COUNTIF(Event1!$D:$D, D223) + COUNTIF(Event2!$D:$D, D223) + COUNTIF(Event3!$D:$D, D223) + COUNTIF(Event4!$D:$D, D223) + COUNTIF(Event5!$D:$D, D223) + COUNTIF(Event6!$D:$D, D223) + COUNTIF(Event7!$D:$D, D223) + COUNTIF(Event8!$D:$D, D223) + COUNTIF(Event9!$D:$D, D223) + COUNTIF(Event10!$D:$D, D223) + COUNTIF(Event11!$D:$D, D223) + COUNTIF(Event12!$D:$D, D223) + COUNTIF(Event13!$D:$D, D223) + COUNTIF(Event14!$D:$D, D223) + COUNTIF(Event15!$D:$D, D223) + COUNTIF(Event16!$D:$D, D223) + COUNTIF(Event17!$D:$D, D223) + COUNTIF(Event18!$D:$D, D223) + COUNTIF(Event19!$D:$D, D223) + COUNTIF(Event20!$D:$D, D223) + COUNTIF(Event21!$D:$D, D223) + COUNTIF(Event22!$D:$D, D223) + COUNTIF(Event23!$D:$D, D223) + COUNTIF(Event24!$D:$D, D223) + COUNTIF(Event25!$D:$D, D223) + 0","v":1},{"$f":"IF(D223=\"\", \"\", IF(IFERROR(VLOOKUP(D223, Dues!D:D, 1, FALSE), \"\")=\"\", \"No\", \"Yes\"))","v":"No"},{"$f":"IF(D223=\"\", \"\", IF(IFERROR(VLOOKUP(D223, Interview!D:D, 1, FALSE), \"\")<>\"\", \"Yes\", IF(OR(C223=\"Fr\", C223=\"So\", AND(C223=\"Sr\", TODAY()<43646)), \"N/A\", \"No\")))","v":"N/A"}]
["Di Fan","Zheng","Sr","dmz5099",{"$f":"COUNTIF(Event1!$D:$D, D224) + COUNTIF(Event2!$D:$D, D224) + COUNTIF(Event3!$D:$D, D224) + COUNTIF(Event4!$D:$D, D224) + COUNTIF(Event5!$D:$D, D224) + COUNTIF(Event6!$D:$D, D224) + COUNTIF(Event7!$D:$D, D224) + COUNTIF(Event8!$D:$D, D224) + COUNTIF(Event9!$D:$D, D224) + COUNTIF(Event10!$D:$D, D224) + COUNTIF(Event11!$D:$D, D224) + COUNTIF(Event12!$D:$D, D224) + COUNTIF(Event13!$D:$D, D224) + COUNTIF(Event14!$D:$D, D224) + COUNTIF(Event15!$D:$D, D224) + COUNTIF(Event16!$D:$D, D224) + COUNTIF(Event17!$D:$D, D224) + COUNTIF(Event18!$D:$D, D224) + COUNTIF(Event19!$D:$D, D224) + COUNTIF(Event20!$D:$D, D224) + COUNTIF(Event21!$D:$D, D224) + COUNTIF(Event22!$D:$D, D224) + COUNTIF(Event23!$D:$D, D224) + COUNTIF(Event24!$D:$D, D224) + COUNTIF(Event25!$D:$D, D224) + 0","v":1},{"$f":"IF(D224=\"\", \"\", IF(IFERROR(VLOOKUP(D224, Dues!D:D, 1, FALSE), \"\")=\"\", \"No\", \"Yes\"))","v":"No"},{"$f":"IF(D224=\"\", \"\", IF(IFERROR(VLOOKUP(D224, Interview!D:D, 1, FALSE), \"\")<>\"\", \"Yes\", IF(OR(C224=\"Fr\", C224=\"So\", AND(C224=\"Sr\", TODAY()<43646)), \"N/A\", \"No\")))","v":"N/A"}]
["Alex","Ventrello","Sr","acv5091",{"$f":"COUNTIF(Event1!$D:$D, D225) + COUNTIF(Event2!$D:$D, D225) + COUNTIF(Event3!$D:$D, D225) + COUNTIF(Event4!$D:$D, D225) + COUNTIF(Event5!$D:$D, D225) + COUNTIF(Event6!$D:$D, D225) + COUNTIF(Event7!$D:$D, D225) + COUNTIF(Event8!$D:$D, D225) + COUNTIF(Event9!$D:$D, D225) + COUNTIF(Event10!$D:$D, D225) + COUNTIF(Event11!$D:$D, D225) + COUNTIF(Event12!$D:$D, D225) + COUNTIF(Event13!$D:$D, D225) + COUNTIF(Event14!$D:$D, D225) + COUNTIF(Event15!$D:$D, D225) + COUNTIF(Event16!$D:$D, D225) + COUNTIF(Event17!$D:$D, D225) + COUNTIF(Event18!$D:$D, D225) + COUNTIF(Event19!$D:$D, D225) + COUNTIF(Event20!$D:$D, D225) + COUNTIF(Event21!$D:$D, D225) + COUNTIF(Event22!$D:$D, D225) + COUNTIF(Event23!$D:$D, D225) + COUNTIF(Event24!$D:$D, D225) + COUNTIF(Event25!$D:$D, D225) + 0","v":1},{"$f":"IF(D225=\"\", \"\", IF(IFERROR(VLOOKUP(D225, Dues!D:D, 1, FALSE), \"\")=\"\", \"No\", \"Yes\"))","v":"No"},{"$f":"IF(D225=\"\", \"\", IF(IFERROR(VLOOKUP(D225, Interview!D:D, 1, FALSE), \"\")<>\"\", \"Yes\", IF(OR(C225=\"Fr\", C225=\"So\", AND(C225=\"Sr\", TODAY()<43646)), \"N/A\", \"No\")))","v":"N/A"}]
["Mathilde ","Hsia","Sr","mfh5323",{"$f":"COUNTIF(Event1!$D:$D, D226) + COUNTIF(Event2!$D:$D, D226) + COUNTIF(Event3!$D:$D, D226) + COUNTIF(Event4!$D:$D, D226) + COUNTIF(Event5!$D:$D, D226) + COUNTIF(Event6!$D:$D, D226) + COUNTIF(Event7!$D:$D, D226) + COUNTIF(Event8!$D:$D, D226) + COUNTIF(Event9!$D:$D, D226) + COUNTIF(Event10!$D:$D, D226) + COUNTIF(Event11!$D:$D, D226) + COUNTIF(Event12!$D:$D, D226) + COUNTIF(Event13!$D:$D, D226) + COUNTIF(Event14!$D:$D, D226) + COUNTIF(Event15!$D:$D, D226) + COUNTIF(Event16!$D:$D, D226) + COUNTIF(Event17!$D:$D, D226) + COUNTIF(Event18!$D:$D, D226) + COUNTIF(Event19!$D:$D, D226) + COUNTIF(Event20!$D:$D, D226) + COUNTIF(Event21!$D:$D, D226) + COUNTIF(Event22!$D:$D, D226) + COUNTIF(Event23!$D:$D, D226) + COUNTIF(Event24!$D:$D, D226) + COUNTIF(Event25!$D:$D, D226) + 0","v":0},{"$f":"IF(D226=\"\", \"\", IF(IFERROR(VLOOKUP(D226, Dues!D:D, 1, FALSE), \"\")=\"\", \"No\", \"Yes\"))","v":"Yes"},{"$f":"IF(D226=\"\", \"\", IF(IFERROR(VLOOKUP(D226, Interview!D:D, 1, FALSE), \"\")<>\"\", \"Yes\", IF(OR(C226=\"Fr\", C226=\"So\", AND(C226=\"Sr\", TODAY()<43646)), \"N/A\", \"No\")))","v":"N/A"}]
["Tianlang ","Li","Jr","HPL5120",{"$f":"COUNTIF(Event1!$D:$D, D227) + COUNTIF(Event2!$D:$D, D227) + COUNTIF(Event3!$D:$D, D227) + COUNTIF(Event4!$D:$D, D227) + COUNTIF(Event5!$D:$D, D227) + COUNTIF(Event6!$D:$D, D227) + COUNTIF(Event7!$D:$D, D227) + COUNTIF(Event8!$D:$D, D227) + COUNTIF(Event9!$D:$D, D227) + COUNTIF(Event10!$D:$D, D227) + COUNTIF(Event11!$D:$D, D227) + COUNTIF(Event12!$D:$D, D227) + COUNTIF(Event13!$D:$D, D227) + COUNTIF(Event14!$D:$D, D227) + COUNTIF(Event15!$D:$D, D227) + COUNTIF(Event16!$D:$D, D227) + COUNTIF(Event17!$D:$D, D227) + COUNTIF(Event18!$D:$D, D227) + COUNTIF(Event19!$D:$D, D227) + COUNTIF(Event20!$D:$D, D227) + COUNTIF(Event21!$D:$D, D227) + COUNTIF(Event22!$D:$D, D227) + COUNTIF(Event23!$D:$D, D227) + COUNTIF(Event24!$D:$D, D227) + COUNTIF(Event25!$D:$D, D227) + 0","v":0},{"$f":"IF(D227=\"\", \"\", IF(IFERROR(VLOOKUP(D227, Dues!D:D, 1, FALSE), \"\")=\"\", \"No\", \"Yes\"))","v":"Yes"},{"$f":"IF(D227=\"\", \"\", IF(IFERROR(VLOOKUP(D227, Interview!D:D, 1, FALSE), \"\")<>\"\", \"Yes\", IF(OR(C227=\"Fr\", C227=\"So\", AND(C227=\"Sr\", TODAY()<43646)), \"N/A\", \"No\")))","v":"Yes"}]
["TJ ","McIntyre","Jr","tjm6163",{"$f":"COUNTIF(Event1!$D:$D, D228) + COUNTIF(Event2!$D:$D, D228) + COUNTIF(Event3!$D:$D, D228) + COUNTIF(Event4!$D:$D, D228) + COUNTIF(Event5!$D:$D, D228) + COUNTIF(Event6!$D:$D, D228) + COUNTIF(Event7!$D:$D, D228) + COUNTIF(Event8!$D:$D, D228) + COUNTIF(Event9!$D:$D, D228) + COUNTIF(Event10!$D:$D, D228) + COUNTIF(Event11!$D:$D, D228) + COUNTIF(Event12!$D:$D, D228) + COUNTIF(Event13!$D:$D, D228) + COUNTIF(Event14!$D:$D, D228) + COUNTIF(Event15!$D:$D, D228) + COUNTIF(Event16!$D:$D, D228) + COUNTIF(Event17!$D:$D, D228) + COUNTIF(Event18!$D:$D, D228) + COUNTIF(Event19!$D:$D, D228) + COUNTIF(Event20!$D:$D, D228) + COUNTIF(Event21!$D:$D, D228) + COUNTIF(Event22!$D:$D, D228) + COUNTIF(Event23!$D:$D, D228) + COUNTIF(Event24!$D:$D, D228) + COUNTIF(Event25!$D:$D, D228) + 0","v":0},{"$f":"IF(D228=\"\", \"\", IF(IFERROR(VLOOKUP(D228, Dues!D:D, 1, FALSE), \"\")=\"\", \"No\", \"Yes\"))","v":"Yes"},{"$f":"IF(D228=\"\", \"\", IF(IFERROR(VLOOKUP(D228, Interview!D:D, 1, FALSE), \"\")<>\"\", \"Yes\", IF(OR(C228=\"Fr\", C228=\"So\", AND(C228=\"Sr\", TODAY()<43646)), \"N/A\", \"No\")))","v":"No"}]
["Kunjal ","Kapadia","Fr","kxk5613",{"$f":"COUNTIF(Event1!$D:$D, D229) + COUNTIF(Event2!$D:$D, D229) + COUNTIF(Event3!$D:$D, D229) + COUNTIF(Event4!$D:$D, D229) + COUNTIF(Event5!$D:$D, D229) + COUNTIF(Event6!$D:$D, D229) + COUNTIF(Event7!$D:$D, D229) + COUNTIF(Event8!$D:$D, D229) + COUNTIF(Event9!$D:$D, D229) + COUNTIF(Event10!$D:$D, D229) + COUNTIF(Event11!$D:$D, D229) + COUNTIF(Event12!$D:$D, D229) + COUNTIF(Event13!$D:$D, D229) + COUNTIF(Event14!$D:$D, D229) + COUNTIF(Event15!$D:$D, D229) + COUNTIF(Event16!$D:$D, D229) + COUNTIF(Event17!$D:$D, D229) + COUNTIF(Event18!$D:$D, D229) + COUNTIF(Event19!$D:$D, D229) + COUNTIF(Event20!$D:$D, D229) + COUNTIF(Event21!$D:$D, D229) + COUNTIF(Event22!$D:$D, D229) + COUNTIF(Event23!$D:$D, D229) + COUNTIF(Event24!$D:$D, D229) + COUNTIF(Event25!$D:$D, D229) + 0","v":0},{"$f":"IF(D229=\"\", \"\", IF(IFERROR(VLOOKUP(D229, Dues!D:D, 1, FALSE), \"\")=\"\", \"No\", \"Yes\"))","v":"Yes"},{"$f":"IF(D229=\"\", \"\", IF(IFERROR(VLOOKUP(D229, Interview!D:D, 1, FALSE), \"\")<>\"\", \"Yes\", IF(OR(C229=\"Fr\", C229=\"So\", AND(C229=\"Sr\", TODAY()<43646)), \"N/A\", \"No\")))","v":"N/A"}]
["Zachary ","Wenning","Fr","zrw5043",{"$f":"COUNTIF(Event1!$D:$D, D230) + COUNTIF(Event2!$D:$D, D230) + COUNTIF(Event3!$D:$D, D230) + COUNTIF(Event4!$D:$D, D230) + COUNTIF(Event5!$D:$D, D230) + COUNTIF(Event6!$D:$D, D230) + COUNTIF(Event7!$D:$D, D230) + COUNTIF(Event8!$D:$D, D230) + COUNTIF(Event9!$D:$D, D230) + COUNTIF(Event10!$D:$D, D230) + COUNTIF(Event11!$D:$D, D230) + COUNTIF(Event12!$D:$D, D230) + COUNTIF(Event13!$D:$D, D230) + COUNTIF(Event14!$D:$D, D230) + COUNTIF(Event15!$D:$D, D230) + COUNTIF(Event16!$D:$D, D230) + COUNTIF(Event17!$D:$D, D230) + COUNTIF(Event18!$D:$D, D230) + COUNTIF(Event19!$D:$D, D230) + COUNTIF(Event20!$D:$D, D230) + COUNTIF(Event21!$D:$D, D230) + COUNTIF(Event22!$D:$D, D230) + COUNTIF(Event23!$D:$D, D230) + COUNTIF(Event24!$D:$D, D230) + COUNTIF(Event25!$D:$D, D230) + 0","v":0},{"$f":"IF(D230=\"\", \"\", IF(IFERROR(VLOOKUP(D230, Dues!D:D, 1, FALSE), \"\")=\"\", \"No\", \"Yes\"))","v":"Yes"},{"$f":"IF(D230=\"\", \"\", IF(IFERROR(VLOOKUP(D230, Interview!D:D, 1, FALSE), \"\")<>\"\", \"Yes\", IF(OR(C230=\"Fr\", C230=\"So\", AND(C230=\"Sr\", TODAY()<43646)), \"N/A\", \"No\")))","v":"N/A"}]
["Ahmad Mohd","Azhar","Jr","AQM6158",{"$f":"COUNTIF(Event1!$D:$D, D231) + COUNTIF(Event2!$D:$D, D231) + COUNTIF(Event3!$D:$D, D231) + COUNTIF(Event4!$D:$D, D231) + COUNTIF(Event5!$D:$D, D231) + COUNTIF(Event6!$D:$D, D231) + COUNTIF(Event7!$D:$D, D231) + COUNTIF(Event8!$D:$D, D231) + COUNTIF(Event9!$D:$D, D231) + COUNTIF(Event10!$D:$D, D231) + COUNTIF(Event11!$D:$D, D231) + COUNTIF(Event12!$D:$D, D231) + COUNTIF(Event13!$D:$D, D231) + COUNTIF(Event14!$D:$D, D231) + COUNTIF(Event15!$D:$D, D231) + COUNTIF(Event16!$D:$D, D231) + COUNTIF(Event17!$D:$D, D231) + COUNTIF(Event18!$D:$D, D231) + COUNTIF(Event19!$D:$D, D231) + COUNTIF(Event20!$D:$D, D231) + COUNTIF(Event21!$D:$D, D231) + COUNTIF(Event22!$D:$D, D231) + COUNTIF(Event23!$D:$D, D231) + COUNTIF(Event24!$D:$D, D231) + COUNTIF(Event25!$D:$D, D231) + 0","v":0},{"$f":"IF(D231=\"\", \"\", IF(IFERROR(VLOOKUP(D231, Dues!D:D, 1, FALSE), \"\")=\"\", \"No\", \"Yes\"))","v":"No"},{"$f":"IF(D231=\"\", \"\", IF(IFERROR(VLOOKUP(D231, Interview!D:D, 1, FALSE), \"\")<>\"\", \"Yes\", IF(OR(C231=\"Fr\", C231=\"So\", AND(C231=\"Sr\", TODAY()<43646)), \"N/A\", \"No\")))","v":"Yes"}]
["Alexis","Carp","Jr","AMC7067",{"$f":"COUNTIF(Event1!$D:$D, D232) + COUNTIF(Event2!$D:$D, D232) + COUNTIF(Event3!$D:$D, D232) + COUNTIF(Event4!$D:$D, D232) + COUNTIF(Event5!$D:$D, D232) + COUNTIF(Event6!$D:$D, D232) + COUNTIF(Event7!$D:$D, D232) + COUNTIF(Event8!$D:$D, D232) + COUNTIF(Event9!$D:$D, D232) + COUNTIF(Event10!$D:$D, D232) + COUNTIF(Event11!$D:$D, D232) + COUNTIF(Event12!$D:$D, D232) + COUNTIF(Event13!$D:$D, D232) + COUNTIF(Event14!$D:$D, D232) + COUNTIF(Event15!$D:$D, D232) + COUNTIF(Event16!$D:$D, D232) + COUNTIF(Event17!$D:$D, D232) + COUNTIF(Event18!$D:$D, D232) + COUNTIF(Event19!$D:$D, D232) + COUNTIF(Event20!$D:$D, D232) + COUNTIF(Event21!$D:$D, D232) + COUNTIF(Event22!$D:$D, D232) + COUNTIF(Event23!$D:$D, D232) + COUNTIF(Event24!$D:$D, D232) + COUNTIF(Event25!$D:$D, D232) + 0","v":0},{"$f":"IF(D232=\"\", \"\", IF(IFERROR(VLOOKUP(D232, Dues!D:D, 1, FALSE), \"\")=\"\", \"No\", \"Yes\"))","v":"No"},{"$f":"IF(D232=\"\", \"\", IF(IFERROR(VLOOKUP(D232, Interview!D:D, 1, FALSE), \"\")<>\"\", \"Yes\", IF(OR(C232=\"Fr\", C232=\"So\", AND(C232=\"Sr\", TODAY()<43646)), \"N/A\", \"No\")))","v":"Yes"}]
["Shumin","Chen","Jr","QUC54",{"$f":"COUNTIF(Event1!$D:$D, D233) + COUNTIF(Event2!$D:$D, D233) + COUNTIF(Event3!$D:$D, D233) + COUNTIF(Event4!$D:$D, D233) + COUNTIF(Event5!$D:$D, D233) + COUNTIF(Event6!$D:$D, D233) + COUNTIF(Event7!$D:$D, D233) + COUNTIF(Event8!$D:$D, D233) + COUNTIF(Event9!$D:$D, D233) + COUNTIF(Event10!$D:$D, D233) + COUNTIF(Event11!$D:$D, D233) + COUNTIF(Event12!$D:$D, D233) + COUNTIF(Event13!$D:$D, D233) + COUNTIF(Event14!$D:$D, D233) + COUNTIF(Event15!$D:$D, D233) + COUNTIF(Event16!$D:$D, D233) + COUNTIF(Event17!$D:$D, D233) + COUNTIF(Event18!$D:$D, D233) + COUNTIF(Event19!$D:$D, D233) + COUNTIF(Event20!$D:$D, D233) + COUNTIF(Event21!$D:$D, D233) + COUNTIF(Event22!$D:$D, D233) + COUNTIF(Event23!$D:$D, D233) + COUNTIF(Event24!$D:$D, D233) + COUNTIF(Event25!$D:$D, D233) + 0","v":0},{"$f":"IF(D233=\"\", \"\", IF(IFERROR(VLOOKUP(D233, Dues!D:D, 1, FALSE), \"\")=\"\", \"No\", \"Yes\"))","v":"No"},{"$f":"IF(D233=\"\", \"\", IF(IFERROR(VLOOKUP(D233, Interview!D:D, 1, FALSE), \"\")<>\"\", \"Yes\", IF(OR(C233=\"Fr\", C233=\"So\", AND(C233=\"Sr\", TODAY()<43646)), \"N/A\", \"No\")))","v":"Yes"}]
["Ying","Chen","Jr","YMC5189",{"$f":"COUNTIF(Event1!$D:$D, D234) + COUNTIF(Event2!$D:$D, D234) + COUNTIF(Event3!$D:$D, D234) + COUNTIF(Event4!$D:$D, D234) + COUNTIF(Event5!$D:$D, D234) + COUNTIF(Event6!$D:$D, D234) + COUNTIF(Event7!$D:$D, D234) + COUNTIF(Event8!$D:$D, D234) + COUNTIF(Event9!$D:$D, D234) + COUNTIF(Event10!$D:$D, D234) + COUNTIF(Event11!$D:$D, D234) + COUNTIF(Event12!$D:$D, D234) + COUNTIF(Event13!$D:$D, D234) + COUNTIF(Event14!$D:$D, D234) + COUNTIF(Event15!$D:$D, D234) + COUNTIF(Event16!$D:$D, D234) + COUNTIF(Event17!$D:$D, D234) + COUNTIF(Event18!$D:$D, D234) + COUNTIF(Event19!$D:$D, D234) + COUNTIF(Event20!$D:$D, D234) + COUNTIF(Event21!$D:$D, D234) + COUNTIF(Event22!$D:$D, D234) + COUNTIF(Event23!$D:$D, D234) + COUNTIF(Event24!$D:$D, D234) + COUNTIF(Event25!$D:$D, D234) + 0","v":0},{"$f":"IF(D234=\"\", \"\", IF(IFERROR(VLOOKUP(D234, Dues!D:D, 1, FALSE), \"\")=\"\", \"No\", \"Yes\"))","v":"No"},{"$f":"IF(D234=\"\", \"\", IF(IFERROR(VLOOKUP(D234, Interview!D:D, 1, FALSE), \"\")<>\"\", \"Yes\", IF(OR(C234=\"Fr\", C234=\"So\", AND(C234=\"Sr\", TODAY()<43646)), \"N/A\", \"No\")))","v":"Yes"}]
["Alexis","Dobransky","Jr","ALD5655",{"$f":"COUNTIF(Event1!$D:$D, D235) + COUNTIF(Event2!$D:$D, D235) + COUNTIF(Event3!$D:$D, D235) + COUNTIF(Event4!$D:$D, D235) + COUNTIF(Event5!$D:$D, D235) + COUNTIF(Event6!$D:$D, D235) + COUNTIF(Event7!$D:$D, D235) + COUNTIF(Event8!$D:$D, D235) + COUNTIF(Event9!$D:$D, D235) + COUNTIF(Event10!$D:$D, D235) + COUNTIF(Event11!$D:$D, D235) + COUNTIF(Event12!$D:$D, D235) + COUNTIF(Event13!$D:$D, D235) + COUNTIF(Event14!$D:$D, D235) + COUNTIF(Event15!$D:$D, D235) + COUNTIF(Event16!$D:$D, D235) + COUNTIF(Event17!$D:$D, D235) + COUNTIF(Event18!$D:$D, D235) + COUNTIF(Event19!$D:$D, D235) + COUNTIF(Event20!$D:$D, D235) + COUNTIF(Event21!$D:$D, D235) + COUNTIF(Event22!$D:$D, D235) + COUNTIF(Event23!$D:$D, D235) + COUNTIF(Event24!$D:$D, D235) + COUNTIF(Event25!$D:$D, D235) + 0","v":0},{"$f":"IF(D235=\"\", \"\", IF(IFERROR(VLOOKUP(D235, Dues!D:D, 1, FALSE), \"\")=\"\", \"No\", \"Yes\"))","v":"No"},{"$f":"IF(D235=\"\", \"\", IF(IFERROR(VLOOKUP(D235, Interview!D:D, 1, FALSE), \"\")<>\"\", \"Yes\", IF(OR(C235=\"Fr\", C235=\"So\", AND(C235=\"Sr\", TODAY()<43646)), \"N/A\", \"No\")))","v":"Yes"}]
["Kyle","Dougherty","Jr","KJD5424",{"$f":"COUNTIF(Event1!$D:$D, D236) + COUNTIF(Event2!$D:$D, D236) + COUNTIF(Event3!$D:$D, D236) + COUNTIF(Event4!$D:$D, D236) + COUNTIF(Event5!$D:$D, D236) + COUNTIF(Event6!$D:$D, D236) + COUNTIF(Event7!$D:$D, D236) + COUNTIF(Event8!$D:$D, D236) + COUNTIF(Event9!$D:$D, D236) + COUNTIF(Event10!$D:$D, D236) + COUNTIF(Event11!$D:$D, D236) + COUNTIF(Event12!$D:$D, D236) + COUNTIF(Event13!$D:$D, D236) + COUNTIF(Event14!$D:$D, D236) + COUNTIF(Event15!$D:$D, D236) + COUNTIF(Event16!$D:$D, D236) + COUNTIF(Event17!$D:$D, D236) + COUNTIF(Event18!$D:$D, D236) + COUNTIF(Event19!$D:$D, D236) + COUNTIF(Event20!$D:$D, D236) + COUNTIF(Event21!$D:$D, D236) + COUNTIF(Event22!$D:$D, D236) + COUNTIF(Event23!$D:$D, D236) + COUNTIF(Event24!$D:$D, D236) + COUNTIF(Event25!$D:$D, D236) + 0","v":0},{"$f":"IF(D236=\"\", \"\", IF(IFERROR(VLOOKUP(D236, Dues!D:D, 1, FALSE), \"\")=\"\", \"No\", \"Yes\"))","v":"No"},{"$f":"IF(D236=\"\", \"\", IF(IFERROR(VLOOKUP(D236, Interview!D:D, 1, FALSE), \"\")<>\"\", \"Yes\", IF(OR(C236=\"Fr\", C236=\"So\", AND(C236=\"Sr\", TODAY()<43646)), \"N/A\", \"No\")))","v":"Yes"}]
["Muhamad Hadi","Haridan","Jr","MFH5449",{"$f":"COUNTIF(Event1!$D:$D, D237) + COUNTIF(Event2!$D:$D, D237) + COUNTIF(Event3!$D:$D, D237) + COUNTIF(Event4!$D:$D, D237) + COUNTIF(Event5!$D:$D, D237) + COUNTIF(Event6!$D:$D, D237) + COUNTIF(Event7!$D:$D, D237) + COUNTIF(Event8!$D:$D, D237) + COUNTIF(Event9!$D:$D, D237) + COUNTIF(Event10!$D:$D, D237) + COUNTIF(Event11!$D:$D, D237) + COUNTIF(Event12!$D:$D, D237) + COUNTIF(Event13!$D:$D, D237) + COUNTIF(Event14!$D:$D, D237) + COUNTIF(Event15!$D:$D, D237) + COUNTIF(Event16!$D:$D, D237) + COUNTIF(Event17!$D:$D, D237) + COUNTIF(Event18!$D:$D, D237) + COUNTIF(Event19!$D:$D, D237) + COUNTIF(Event20!$D:$D, D237) + COUNTIF(Event21!$D:$D, D237) + COUNTIF(Event22!$D:$D, D237) + COUNTIF(Event23!$D:$D, D237) + COUNTIF(Event24!$D:$D, D237) + COUNTIF(Event25!$D:$D, D237) + 0","v":0},{"$f":"IF(D237=\"\", \"\", IF(IFERROR(VLOOKUP(D237, Dues!D:D, 1, FALSE), \"\")=\"\", \"No\", \"Yes\"))","v":"No"},{"$f":"IF(D237=\"\", \"\", IF(IFERROR(VLOOKUP(D237, Interview!D:D, 1, FALSE), \"\")<>\"\", \"Yes\", IF(OR(C237=\"Fr\", C237=\"So\", AND(C237=\"Sr\", TODAY()<43646)), \"N/A\", \"No\")))","v":"Yes"}]
["Rebecca","Hobman","Jr","RBH5207",{"$f":"COUNTIF(Event1!$D:$D, D238) + COUNTIF(Event2!$D:$D, D238) + COUNTIF(Event3!$D:$D, D238) + COUNTIF(Event4!$D:$D, D238) + COUNTIF(Event5!$D:$D, D238) + COUNTIF(Event6!$D:$D, D238) + COUNTIF(Event7!$D:$D, D238) + COUNTIF(Event8!$D:$D, D238) + COUNTIF(Event9!$D:$D, D238) + COUNTIF(Event10!$D:$D, D238) + COUNTIF(Event11!$D:$D, D238) + COUNTIF(Event12!$D:$D, D238) + COUNTIF(Event13!$D:$D, D238) + COUNTIF(Event14!$D:$D, D238) + COUNTIF(Event15!$D:$D, D238) + COUNTIF(Event16!$D:$D, D238) + COUNTIF(Event17!$D:$D, D238) + COUNTIF(Event18!$D:$D, D238) + COUNTIF(Event19!$D:$D, D238) + COUNTIF(Event20!$D:$D, D238) + COUNTIF(Event21!$D:$D, D238) + COUNTIF(Event22!$D:$D, D238) + COUNTIF(Event23!$D:$D, D238) + COUNTIF(Event24!$D:$D, D238) + COUNTIF(Event25!$D:$D, D238) + 0","v":0},{"$f":"IF(D238=\"\", \"\", IF(IFERROR(VLOOKUP(D238, Dues!D:D, 1, FALSE), \"\")=\"\", \"No\", \"Yes\"))","v":"No"},{"$f":"IF(D238=\"\", \"\", IF(IFERROR(VLOOKUP(D238, Interview!D:D, 1, FALSE), \"\")<>\"\", \"Yes\", IF(OR(C238=\"Fr\", C238=\"So\", AND(C238=\"Sr\", TODAY()<43646)), \"N/A\", \"No\")))","v":"Yes"}]
["Mitchell","Ledven","Jr","MRL5449",{"$f":"COUNTIF(Event1!$D:$D, D239) + COUNTIF(Event2!$D:$D, D239) + COUNTIF(Event3!$D:$D, D239) + COUNTIF(Event4!$D:$D, D239) + COUNTIF(Event5!$D:$D, D239) + COUNTIF(Event6!$D:$D, D239) + COUNTIF(Event7!$D:$D, D239) + COUNTIF(Event8!$D:$D, D239) + COUNTIF(Event9!$D:$D, D239) + COUNTIF(Event10!$D:$D, D239) + COUNTIF(Event11!$D:$D, D239) + COUNTIF(Event12!$D:$D, D239) + COUNTIF(Event13!$D:$D, D239) + COUNTIF(Event14!$D:$D, D239) + COUNTIF(Event15!$D:$D, D239) + COUNTIF(Event16!$D:$D, D239) + COUNTIF(Event17!$D:$D, D239) + COUNTIF(Event18!$D:$D, D239) + COUNTIF(Event19!$D:$D, D239) + COUNTIF(Event20!$D:$D, D239) + COUNTIF(Event21!$D:$D, D239) + COUNTIF(Event22!$D:$D, D239) + COUNTIF(Event23!$D:$D, D239) + COUNTIF(Event24!$D:$D, D239) + COUNTIF(Event25!$D:$D, D239) + 0","v":0},{"$f":"IF(D239=\"\", \"\", IF(IFERROR(VLOOKUP(D239, Dues!D:D, 1, FALSE), \"\")=\"\", \"No\", \"Yes\"))","v":"No"},{"$f":"IF(D239=\"\", \"\", IF(IFERROR(VLOOKUP(D239, Interview!D:D, 1, FALSE), \"\")<>\"\", \"Yes\", IF(OR(C239=\"Fr\", C239=\"So\", AND(C239=\"Sr\", TODAY()<43646)), \"N/A\", \"No\")))","v":"Yes"}]
["Heming","Liu","Jr","HXL335",{"$f":"COUNTIF(Event1!$D:$D, D240) + COUNTIF(Event2!$D:$D, D240) + COUNTIF(Event3!$D:$D, D240) + COUNTIF(Event4!$D:$D, D240) + COUNTIF(Event5!$D:$D, D240) + COUNTIF(Event6!$D:$D, D240) + COUNTIF(Event7!$D:$D, D240) + COUNTIF(Event8!$D:$D, D240) + COUNTIF(Event9!$D:$D, D240) + COUNTIF(Event10!$D:$D, D240) + COUNTIF(Event11!$D:$D, D240) + COUNTIF(Event12!$D:$D, D240) + COUNTIF(Event13!$D:$D, D240) + COUNTIF(Event14!$D:$D, D240) + COUNTIF(Event15!$D:$D, D240) + COUNTIF(Event16!$D:$D, D240) + COUNTIF(Event17!$D:$D, D240) + COUNTIF(Event18!$D:$D, D240) + COUNTIF(Event19!$D:$D, D240) + COUNTIF(Event20!$D:$D, D240) + COUNTIF(Event21!$D:$D, D240) + COUNTIF(Event22!$D:$D, D240) + COUNTIF(Event23!$D:$D, D240) + COUNTIF(Event24!$D:$D, D240) + COUNTIF(Event25!$D:$D, D240) + 0","v":0},{"$f":"IF(D240=\"\", \"\", IF(IFERROR(VLOOKUP(D240, Dues!D:D, 1, FALSE), \"\")=\"\", \"No\", \"Yes\"))","v":"No"},{"$f":"IF(D240=\"\", \"\", IF(IFERROR(VLOOKUP(D240, Interview!D:D, 1, FALSE), \"\")<>\"\", \"Yes\", IF(OR(C240=\"Fr\", C240=\"So\", AND(C240=\"Sr\", TODAY()<43646)), \"N/A\", \"No\")))","v":"Yes"}]
["Hao","Lu","Jr","hfl5046",{"$f":"COUNTIF(Event1!$D:$D, D241) + COUNTIF(Event2!$D:$D, D241) + COUNTIF(Event3!$D:$D, D241) + COUNTIF(Event4!$D:$D, D241) + COUNTIF(Event5!$D:$D, D241) + COUNTIF(Event6!$D:$D, D241) + COUNTIF(Event7!$D:$D, D241) + COUNTIF(Event8!$D:$D, D241) + COUNTIF(Event9!$D:$D, D241) + COUNTIF(Event10!$D:$D, D241) + COUNTIF(Event11!$D:$D, D241) + COUNTIF(Event12!$D:$D, D241) + COUNTIF(Event13!$D:$D, D241) + COUNTIF(Event14!$D:$D, D241) + COUNTIF(Event15!$D:$D, D241) + COUNTIF(Event16!$D:$D, D241) + COUNTIF(Event17!$D:$D, D241) + COUNTIF(Event18!$D:$D, D241) + COUNTIF(Event19!$D:$D, D241) + COUNTIF(Event20!$D:$D, D241) + COUNTIF(Event21!$D:$D, D241) + COUNTIF(Event22!$D:$D, D241) + COUNTIF(Event23!$D:$D, D241) + COUNTIF(Event24!$D:$D, D241) + COUNTIF(Event25!$D:$D, D241) + 0","v":0},{"$f":"IF(D241=\"\", \"\", IF(IFERROR(VLOOKUP(D241, Dues!D:D, 1, FALSE), \"\")=\"\", \"No\", \"Yes\"))","v":"No"},{"$f":"IF(D241=\"\", \"\", IF(IFERROR(VLOOKUP(D241, Interview!D:D, 1, FALSE), \"\")<>\"\", \"Yes\", IF(OR(C241=\"Fr\", C241=\"So\", AND(C241=\"Sr\", TODAY()<43646)), \"N/A\", \"No\")))","v":"Yes"}]
["Jiayu","Luo","Jr","JZL299",{"$f":"COUNTIF(Event1!$D:$D, D242) + COUNTIF(Event2!$D:$D, D242) + COUNTIF(Event3!$D:$D, D242) + COUNTIF(Event4!$D:$D, D242) + COUNTIF(Event5!$D:$D, D242) + COUNTIF(Event6!$D:$D, D242) + COUNTIF(Event7!$D:$D, D242) + COUNTIF(Event8!$D:$D, D242) + COUNTIF(Event9!$D:$D, D242) + COUNTIF(Event10!$D:$D, D242) + COUNTIF(Event11!$D:$D, D242) + COUNTIF(Event12!$D:$D, D242) + COUNTIF(Event13!$D:$D, D242) + COUNTIF(Event14!$D:$D, D242) + COUNTIF(Event15!$D:$D, D242) + COUNTIF(Event16!$D:$D, D242) + COUNTIF(Event17!$D:$D, D242) + COUNTIF(Event18!$D:$D, D242) + COUNTIF(Event19!$D:$D, D242) + COUNTIF(Event20!$D:$D, D242) + COUNTIF(Event21!$D:$D, D242) + COUNTIF(Event22!$D:$D, D242) + COUNTIF(Event23!$D:$D, D242) + COUNTIF(Event24!$D:$D, D242) + COUNTIF(Event25!$D:$D, D242) + 0","v":0},{"$f":"IF(D242=\"\", \"\", IF(IFERROR(VLOOKUP(D242, Dues!D:D, 1, FALSE), \"\")=\"\", \"No\", \"Yes\"))","v":"No"},{"$f":"IF(D242=\"\", \"\", IF(IFERROR(VLOOKUP(D242, Interview!D:D, 1, FALSE), \"\")<>\"\", \"Yes\", IF(OR(C242=\"Fr\", C242=\"So\", AND(C242=\"Sr\", TODAY()<43646)), \"N/A\", \"No\")))","v":"Yes"}]
["Xijia","Luo","Jr","XKL5056",{"$f":"COUNTIF(Event1!$D:$D, D243) + COUNTIF(Event2!$D:$D, D243) + COUNTIF(Event3!$D:$D, D243) + COUNTIF(Event4!$D:$D, D243) + COUNTIF(Event5!$D:$D, D243) + COUNTIF(Event6!$D:$D, D243) + COUNTIF(Event7!$D:$D, D243) + COUNTIF(Event8!$D:$D, D243) + COUNTIF(Event9!$D:$D, D243) + COUNTIF(Event10!$D:$D, D243) + COUNTIF(Event11!$D:$D, D243) + COUNTIF(Event12!$D:$D, D243) + COUNTIF(Event13!$D:$D, D243) + COUNTIF(Event14!$D:$D, D243) + COUNTIF(Event15!$D:$D, D243) + COUNTIF(Event16!$D:$D, D243) + COUNTIF(Event17!$D:$D, D243) + COUNTIF(Event18!$D:$D, D243) + COUNTIF(Event19!$D:$D, D243) + COUNTIF(Event20!$D:$D, D243) + COUNTIF(Event21!$D:$D, D243) + COUNTIF(Event22!$D:$D, D243) + COUNTIF(Event23!$D:$D, D243) + COUNTIF(Event24!$D:$D, D243) + COUNTIF(Event25!$D:$D, D243) + 0","v":0},{"$f":"IF(D243=\"\", \"\", IF(IFERROR(VLOOKUP(D243, Dues!D:D, 1, FALSE), \"\")=\"\", \"No\", \"Yes\"))","v":"No"},{"$f":"IF(D243=\"\", \"\", IF(IFERROR(VLOOKUP(D243, Interview!D:D, 1, FALSE), \"\")<>\"\", \"Yes\", IF(OR(C243=\"Fr\", C243=\"So\", AND(C243=\"Sr\", TODAY()<43646)), \"N/A\", \"No\")))","v":"Yes"}]
["Lang","Mai","Jr","LUM95",{"$f":"COUNTIF(Event1!$D:$D, D244) + COUNTIF(Event2!$D:$D, D244) + COUNTIF(Event3!$D:$D, D244) + COUNTIF(Event4!$D:$D, D244) + COUNTIF(Event5!$D:$D, D244) + COUNTIF(Event6!$D:$D, D244) + COUNTIF(Event7!$D:$D, D244) + COUNTIF(Event8!$D:$D, D244) + COUNTIF(Event9!$D:$D, D244) + COUNTIF(Event10!$D:$D, D244) + COUNTIF(Event11!$D:$D, D244) + COUNTIF(Event12!$D:$D, D244) + COUNTIF(Event13!$D:$D, D244) + COUNTIF(Event14!$D:$D, D244) + COUNTIF(Event15!$D:$D, D244) + COUNTIF(Event16!$D:$D, D244) + COUNTIF(Event17!$D:$D, D244) + COUNTIF(Event18!$D:$D, D244) + COUNTIF(Event19!$D:$D, D244) + COUNTIF(Event20!$D:$D, D244) + COUNTIF(Event21!$D:$D, D244) + COUNTIF(Event22!$D:$D, D244) + COUNTIF(Event23!$D:$D, D244) + COUNTIF(Event24!$D:$D, D244) + COUNTIF(Event25!$D:$D, D244) + 0","v":0},{"$f":"IF(D244=\"\", \"\", IF(IFERROR(VLOOKUP(D244, Dues!D:D, 1, FALSE), \"\")=\"\", \"No\", \"Yes\"))","v":"No"},{"$f":"IF(D244=\"\", \"\", IF(IFERROR(VLOOKUP(D244, Interview!D:D, 1, FALSE), \"\")<>\"\", \"Yes\", IF(OR(C244=\"Fr\", C244=\"So\", AND(C244=\"Sr\", TODAY()<43646)), \"N/A\", \"No\")))","v":"Yes"}]
["Twinkle","Malhotra","Jr","TZM5406",{"$f":"COUNTIF(Event1!$D:$D, D245) + COUNTIF(Event2!$D:$D, D245) + COUNTIF(Event3!$D:$D, D245) + COUNTIF(Event4!$D:$D, D245) + COUNTIF(Event5!$D:$D, D245) + COUNTIF(Event6!$D:$D, D245) + COUNTIF(Event7!$D:$D, D245) + COUNTIF(Event8!$D:$D, D245) + COUNTIF(Event9!$D:$D, D245) + COUNTIF(Event10!$D:$D, D245) + COUNTIF(Event11!$D:$D, D245) + COUNTIF(Event12!$D:$D, D245) + COUNTIF(Event13!$D:$D, D245) + COUNTIF(Event14!$D:$D, D245) + COUNTIF(Event15!$D:$D, D245) + COUNTIF(Event16!$D:$D, D245) + COUNTIF(Event17!$D:$D, D245) + COUNTIF(Event18!$D:$D, D245) + COUNTIF(Event19!$D:$D, D245) + COUNTIF(Event20!$D:$D, D245) + COUNTIF(Event21!$D:$D, D245) + COUNTIF(Event22!$D:$D, D245) + COUNTIF(Event23!$D:$D, D245) + COUNTIF(Event24!$D:$D, D245) + COUNTIF(Event25!$D:$D, D245) + 0","v":0},{"$f":"IF(D245=\"\", \"\", IF(IFERROR(VLOOKUP(D245, Dues!D:D, 1, FALSE), \"\")=\"\", \"No\", \"Yes\"))","v":"No"},{"$f":"IF(D245=\"\", \"\", IF(IFERROR(VLOOKUP(D245, Interview!D:D, 1, FALSE), \"\")<>\"\", \"Yes\", IF(OR(C245=\"Fr\", C245=\"So\", AND(C245=\"Sr\", TODAY()<43646)), \"N/A\", \"No\")))","v":"Yes"}]
["Marina","Mautner Wizentier","Jr","MQM6104",{"$f":"COUNTIF(Event1!$D:$D, D246) + COUNTIF(Event2!$D:$D, D246) + COUNTIF(Event3!$D:$D, D246) + COUNTIF(Event4!$D:$D, D246) + COUNTIF(Event5!$D:$D, D246) + COUNTIF(Event6!$D:$D, D246) + COUNTIF(Event7!$D:$D, D246) + COUNTIF(Event8!$D:$D, D246) + COUNTIF(Event9!$D:$D, D246) + COUNTIF(Event10!$D:$D, D246) + COUNTIF(Event11!$D:$D, D246) + COUNTIF(Event12!$D:$D, D246) + COUNTIF(Event13!$D:$D, D246) + COUNTIF(Event14!$D:$D, D246) + COUNTIF(Event15!$D:$D, D246) + COUNTIF(Event16!$D:$D, D246) + COUNTIF(Event17!$D:$D, D246) + COUNTIF(Event18!$D:$D, D246) + COUNTIF(Event19!$D:$D, D246) + COUNTIF(Event20!$D:$D, D246) + COUNTIF(Event21!$D:$D, D246) + COUNTIF(Event22!$D:$D, D246) + COUNTIF(Event23!$D:$D, D246) + COUNTIF(Event24!$D:$D, D246) + COUNTIF(Event25!$D:$D, D246) + 0","v":0},{"$f":"IF(D246=\"\", \"\", IF(IFERROR(VLOOKUP(D246, Dues!D:D, 1, FALSE), \"\")=\"\", \"No\", \"Yes\"))","v":"No"},{"$f":"IF(D246=\"\", \"\", IF(IFERROR(VLOOKUP(D246, Interview!D:D, 1, FALSE), \"\")<>\"\", \"Yes\", IF(OR(C246=\"Fr\", C246=\"So\", AND(C246=\"Sr\", TODAY()<43646)), \"N/A\", \"No\")))","v":"Yes"}]
["Alexandra","Mccormack","Jr","AVM5978",{"$f":"COUNTIF(Event1!$D:$D, D247) + COUNTIF(Event2!$D:$D, D247) + COUNTIF(Event3!$D:$D, D247) + COUNTIF(Event4!$D:$D, D247) + COUNTIF(Event5!$D:$D, D247) + COUNTIF(Event6!$D:$D, D247) + COUNTIF(Event7!$D:$D, D247) + COUNTIF(Event8!$D:$D, D247) + COUNTIF(Event9!$D:$D, D247) + COUNTIF(Event10!$D:$D, D247) + COUNTIF(Event11!$D:$D, D247) + COUNTIF(Event12!$D:$D, D247) + COUNTIF(Event13!$D:$D, D247) + COUNTIF(Event14!$D:$D, D247) + COUNTIF(Event15!$D:$D, D247) + COUNTIF(Event16!$D:$D, D247) + COUNTIF(Event17!$D:$D, D247) + COUNTIF(Event18!$D:$D, D247) + COUNTIF(Event19!$D:$D, D247) + COUNTIF(Event20!$D:$D, D247) + COUNTIF(Event21!$D:$D, D247) + COUNTIF(Event22!$D:$D, D247) + COUNTIF(Event23!$D:$D, D247) + COUNTIF(Event24!$D:$D, D247) + COUNTIF(Event25!$D:$D, D247) + 0","v":0},{"$f":"IF(D247=\"\", \"\", IF(IFERROR(VLOOKUP(D247, Dues!D:D, 1, FALSE), \"\")=\"\", \"No\", \"Yes\"))","v":"No"},{"$f":"IF(D247=\"\", \"\", IF(IFERROR(VLOOKUP(D247, Interview!D:D, 1, FALSE), \"\")<>\"\", \"Yes\", IF(OR(C247=\"Fr\", C247=\"So\", AND(C247=\"Sr\", TODAY()<43646)), \"N/A\", \"No\")))","v":"Yes"}]
["Chunlan","Mo","Jr","CXM981",{"$f":"COUNTIF(Event1!$D:$D, D248) + COUNTIF(Event2!$D:$D, D248) + COUNTIF(Event3!$D:$D, D248) + COUNTIF(Event4!$D:$D, D248) + COUNTIF(Event5!$D:$D, D248) + COUNTIF(Event6!$D:$D, D248) + COUNTIF(Event7!$D:$D, D248) + COUNTIF(Event8!$D:$D, D248) + COUNTIF(Event9!$D:$D, D248) + COUNTIF(Event10!$D:$D, D248) + COUNTIF(Event11!$D:$D, D248) + COUNTIF(Event12!$D:$D, D248) + COUNTIF(Event13!$D:$D, D248) + COUNTIF(Event14!$D:$D, D248) + COUNTIF(Event15!$D:$D, D248) + COUNTIF(Event16!$D:$D, D248) + COUNTIF(Event17!$D:$D, D248) + COUNTIF(Event18!$D:$D, D248) + COUNTIF(Event19!$D:$D, D248) + COUNTIF(Event20!$D:$D, D248) + COUNTIF(Event21!$D:$D, D248) + COUNTIF(Event22!$D:$D, D248) + COUNTIF(Event23!$D:$D, D248) + COUNTIF(Event24!$D:$D, D248) + COUNTIF(Event25!$D:$D, D248) + 0","v":0},{"$f":"IF(D248=\"\", \"\", IF(IFERROR(VLOOKUP(D248, Dues!D:D, 1, FALSE), \"\")=\"\", \"No\", \"Yes\"))","v":"No"},{"$f":"IF(D248=\"\", \"\", IF(IFERROR(VLOOKUP(D248, Interview!D:D, 1, FALSE), \"\")<>\"\", \"Yes\", IF(OR(C248=\"Fr\", C248=\"So\", AND(C248=\"Sr\", TODAY()<43646)), \"N/A\", \"No\")))","v":"Yes"}]
["Iffah","Mohamad Saufi","Jr","IVM5141",{"$f":"COUNTIF(Event1!$D:$D, D249) + COUNTIF(Event2!$D:$D, D249) + COUNTIF(Event3!$D:$D, D249) + COUNTIF(Event4!$D:$D, D249) + COUNTIF(Event5!$D:$D, D249) + COUNTIF(Event6!$D:$D, D249) + COUNTIF(Event7!$D:$D, D249) + COUNTIF(Event8!$D:$D, D249) + COUNTIF(Event9!$D:$D, D249) + COUNTIF(Event10!$D:$D, D249) + COUNTIF(Event11!$D:$D, D249) + COUNTIF(Event12!$D:$D, D249) + COUNTIF(Event13!$D:$D, D249) + COUNTIF(Event14!$D:$D, D249) + COUNTIF(Event15!$D:$D, D249) + COUNTIF(Event16!$D:$D, D249) + COUNTIF(Event17!$D:$D, D249) + COUNTIF(Event18!$D:$D, D249) + COUNTIF(Event19!$D:$D, D249) + COUNTIF(Event20!$D:$D, D249) + COUNTIF(Event21!$D:$D, D249) + COUNTIF(Event22!$D:$D, D249) + COUNTIF(Event23!$D:$D, D249) + COUNTIF(Event24!$D:$D, D249) + COUNTIF(Event25!$D:$D, D249) + 0","v":0},{"$f":"IF(D249=\"\", \"\", IF(IFERROR(VLOOKUP(D249, Dues!D:D, 1, FALSE), \"\")=\"\", \"No\", \"Yes\"))","v":"No"},{"$f":"IF(D249=\"\", \"\", IF(IFERROR(VLOOKUP(D249, Interview!D:D, 1, FALSE), \"\")<>\"\", \"Yes\", IF(OR(C249=\"Fr\", C249=\"So\", AND(C249=\"Sr\", TODAY()<43646)), \"N/A\", \"No\")))","v":"Yes"}]
["Emma Lee","Parvess","Jr","EMP5462",{"$f":"COUNTIF(Event1!$D:$D, D250) + COUNTIF(Event2!$D:$D, D250) + COUNTIF(Event3!$D:$D, D250) + COUNTIF(Event4!$D:$D, D250) + COUNTIF(Event5!$D:$D, D250) + COUNTIF(Event6!$D:$D, D250) + COUNTIF(Event7!$D:$D, D250) + COUNTIF(Event8!$D:$D, D250) + COUNTIF(Event9!$D:$D, D250) + COUNTIF(Event10!$D:$D, D250) + COUNTIF(Event11!$D:$D, D250) + COUNTIF(Event12!$D:$D, D250) + COUNTIF(Event13!$D:$D, D250) + COUNTIF(Event14!$D:$D, D250) + COUNTIF(Event15!$D:$D, D250) + COUNTIF(Event16!$D:$D, D250) + COUNTIF(Event17!$D:$D, D250) + COUNTIF(Event18!$D:$D, D250) + COUNTIF(Event19!$D:$D, D250) + COUNTIF(Event20!$D:$D, D250) + COUNTIF(Event21!$D:$D, D250) + COUNTIF(Event22!$D:$D, D250) + COUNTIF(Event23!$D:$D, D250) + COUNTIF(Event24!$D:$D, D250) + COUNTIF(Event25!$D:$D, D250) + 0","v":0},{"$f":"IF(D250=\"\", \"\", IF(IFERROR(VLOOKUP(D250, Dues!D:D, 1, FALSE), \"\")=\"\", \"No\", \"Yes\"))","v":"No"},{"$f":"IF(D250=\"\", \"\", IF(IFERROR(VLOOKUP(D250, Interview!D:D, 1, FALSE), \"\")<>\"\", \"Yes\", IF(OR(C250=\"Fr\", C250=\"So\", AND(C250=\"Sr\", TODAY()<43646)), \"N/A\", \"No\")))","v":"Yes"}]
["Kiera","Pawlikowsky","Jr","KJP5515",{"$f":"COUNTIF(Event1!$D:$D, D251) + COUNTIF(Event2!$D:$D, D251) + COUNTIF(Event3!$D:$D, D251) + COUNTIF(Event4!$D:$D, D251) + COUNTIF(Event5!$D:$D, D251) + COUNTIF(Event6!$D:$D, D251) + COUNTIF(Event7!$D:$D, D251) + COUNTIF(Event8!$D:$D, D251) + COUNTIF(Event9!$D:$D, D251) + COUNTIF(Event10!$D:$D, D251) + COUNTIF(Event11!$D:$D, D251) + COUNTIF(Event12!$D:$D, D251) + COUNTIF(Event13!$D:$D, D251) + COUNTIF(Event14!$D:$D, D251) + COUNTIF(Event15!$D:$D, D251) + COUNTIF(Event16!$D:$D, D251) + COUNTIF(Event17!$D:$D, D251) + COUNTIF(Event18!$D:$D, D251) + COUNTIF(Event19!$D:$D, D251) + COUNTIF(Event20!$D:$D, D251) + COUNTIF(Event21!$D:$D, D251) + COUNTIF(Event22!$D:$D, D251) + COUNTIF(Event23!$D:$D, D251) + COUNTIF(Event24!$D:$D, D251) + COUNTIF(Event25!$D:$D, D251) + 0","v":0},{"$f":"IF(D251=\"\", \"\", IF(IFERROR(VLOOKUP(D251, Dues!D:D, 1, FALSE), \"\")=\"\", \"No\", \"Yes\"))","v":"No"},{"$f":"IF(D251=\"\", \"\", IF(IFERROR(VLOOKUP(D251, Interview!D:D, 1, FALSE), \"\")<>\"\", \"Yes\", IF(OR(C251=\"Fr\", C251=\"So\", AND(C251=\"Sr\", TODAY()<43646)), \"N/A\", \"No\")))","v":"Yes"}]
["Alia","Razali","Jr","AUR268",{"$f":"COUNTIF(Event1!$D:$D, D252) + COUNTIF(Event2!$D:$D, D252) + COUNTIF(Event3!$D:$D, D252) + COUNTIF(Event4!$D:$D, D252) + COUNTIF(Event5!$D:$D, D252) + COUNTIF(Event6!$D:$D, D252) + COUNTIF(Event7!$D:$D, D252) + COUNTIF(Event8!$D:$D, D252) + COUNTIF(Event9!$D:$D, D252) + COUNTIF(Event10!$D:$D, D252) + COUNTIF(Event11!$D:$D, D252) + COUNTIF(Event12!$D:$D, D252) + COUNTIF(Event13!$D:$D, D252) + COUNTIF(Event14!$D:$D, D252) + COUNTIF(Event15!$D:$D, D252) + COUNTIF(Event16!$D:$D, D252) + COUNTIF(Event17!$D:$D, D252) + COUNTIF(Event18!$D:$D, D252) + COUNTIF(Event19!$D:$D, D252) + COUNTIF(Event20!$D:$D, D252) + COUNTIF(Event21!$D:$D, D252) + COUNTIF(Event22!$D:$D, D252) + COUNTIF(Event23!$D:$D, D252) + COUNTIF(Event24!$D:$D, D252) + COUNTIF(Event25!$D:$D, D252) + 0","v":0},{"$f":"IF(D252=\"\", \"\", IF(IFERROR(VLOOKUP(D252, Dues!D:D, 1, FALSE), \"\")=\"\", \"No\", \"Yes\"))","v":"No"},{"$f":"IF(D252=\"\", \"\", IF(IFERROR(VLOOKUP(D252, Interview!D:D, 1, FALSE), \"\")<>\"\", \"Yes\", IF(OR(C252=\"Fr\", C252=\"So\", AND(C252=\"Sr\", TODAY()<43646)), \"N/A\", \"No\")))","v":"Yes"}]
["Zhengyang","Shan","Jr","ZJS5170",{"$f":"COUNTIF(Event1!$D:$D, D253) + COUNTIF(Event2!$D:$D, D253) + COUNTIF(Event3!$D:$D, D253) + COUNTIF(Event4!$D:$D, D253) + COUNTIF(Event5!$D:$D, D253) + COUNTIF(Event6!$D:$D, D253) + COUNTIF(Event7!$D:$D, D253) + COUNTIF(Event8!$D:$D, D253) + COUNTIF(Event9!$D:$D, D253) + COUNTIF(Event10!$D:$D, D253) + COUNTIF(Event11!$D:$D, D253) + COUNTIF(Event12!$D:$D, D253) + COUNTIF(Event13!$D:$D, D253) + COUNTIF(Event14!$D:$D, D253) + COUNTIF(Event15!$D:$D, D253) + COUNTIF(Event16!$D:$D, D253) + COUNTIF(Event17!$D:$D, D253) + COUNTIF(Event18!$D:$D, D253) + COUNTIF(Event19!$D:$D, D253) + COUNTIF(Event20!$D:$D, D253) + COUNTIF(Event21!$D:$D, D253) + COUNTIF(Event22!$D:$D, D253) + COUNTIF(Event23!$D:$D, D253) + COUNTIF(Event24!$D:$D, D253) + COUNTIF(Event25!$D:$D, D253) + 0","v":0},{"$f":"IF(D253=\"\", \"\", IF(IFERROR(VLOOKUP(D253, Dues!D:D, 1, FALSE), \"\")=\"\", \"No\", \"Yes\"))","v":"No"},{"$f":"IF(D253=\"\", \"\", IF(IFERROR(VLOOKUP(D253, Interview!D:D, 1, FALSE), \"\")<>\"\", \"Yes\", IF(OR(C253=\"Fr\", C253=\"So\", AND(C253=\"Sr\", TODAY()<43646)), \"N/A\", \"No\")))","v":"Yes"}]
["Helin","Sui","Jr","HZS58",{"$f":"COUNTIF(Event1!$D:$D, D254) + COUNTIF(Event2!$D:$D, D254) + COUNTIF(Event3!$D:$D, D254) + COUNTIF(Event4!$D:$D, D254) + COUNTIF(Event5!$D:$D, D254) + COUNTIF(Event6!$D:$D, D254) + COUNTIF(Event7!$D:$D, D254) + COUNTIF(Event8!$D:$D, D254) + COUNTIF(Event9!$D:$D, D254) + COUNTIF(Event10!$D:$D, D254) + COUNTIF(Event11!$D:$D, D254) + COUNTIF(Event12!$D:$D, D254) + COUNTIF(Event13!$D:$D, D254) + COUNTIF(Event14!$D:$D, D254) + COUNTIF(Event15!$D:$D, D254) + COUNTIF(Event16!$D:$D, D254) + COUNTIF(Event17!$D:$D, D254) + COUNTIF(Event18!$D:$D, D254) + COUNTIF(Event19!$D:$D, D254) + COUNTIF(Event20!$D:$D, D254) + COUNTIF(Event21!$D:$D, D254) + COUNTIF(Event22!$D:$D, D254) + COUNTIF(Event23!$D:$D, D254) + COUNTIF(Event24!$D:$D, D254) + COUNTIF(Event25!$D:$D, D254) + 0","v":0},{"$f":"IF(D254=\"\", \"\", IF(IFERROR(VLOOKUP(D254, Dues!D:D, 1, FALSE), \"\")=\"\", \"No\", \"Yes\"))","v":"No"},{"$f":"IF(D254=\"\", \"\", IF(IFERROR(VLOOKUP(D254, Interview!D:D, 1, FALSE), \"\")<>\"\", \"Yes\", IF(OR(C254=\"Fr\", C254=\"So\", AND(C254=\"Sr\", TODAY()<43646)), \"N/A\", \"No\")))","v":"Yes"}]
["Rebekah","Thompson","Jr","RGT5044",{"$f":"COUNTIF(Event1!$D:$D, D255) + COUNTIF(Event2!$D:$D, D255) + COUNTIF(Event3!$D:$D, D255) + COUNTIF(Event4!$D:$D, D255) + COUNTIF(Event5!$D:$D, D255) + COUNTIF(Event6!$D:$D, D255) + COUNTIF(Event7!$D:$D, D255) + COUNTIF(Event8!$D:$D, D255) + COUNTIF(Event9!$D:$D, D255) + COUNTIF(Event10!$D:$D, D255) + COUNTIF(Event11!$D:$D, D255) + COUNTIF(Event12!$D:$D, D255) + COUNTIF(Event13!$D:$D, D255) + COUNTIF(Event14!$D:$D, D255) + COUNTIF(Event15!$D:$D, D255) + COUNTIF(Event16!$D:$D, D255) + COUNTIF(Event17!$D:$D, D255) + COUNTIF(Event18!$D:$D, D255) + COUNTIF(Event19!$D:$D, D255) + COUNTIF(Event20!$D:$D, D255) + COUNTIF(Event21!$D:$D, D255) + COUNTIF(Event22!$D:$D, D255) + COUNTIF(Event23!$D:$D, D255) + COUNTIF(Event24!$D:$D, D255) + COUNTIF(Event25!$D:$D, D255) + 0","v":0},{"$f":"IF(D255=\"\", \"\", IF(IFERROR(VLOOKUP(D255, Dues!D:D, 1, FALSE), \"\")=\"\", \"No\", \"Yes\"))","v":"No"},{"$f":"IF(D255=\"\", \"\", IF(IFERROR(VLOOKUP(D255, Interview!D:D, 1, FALSE), \"\")<>\"\", \"Yes\", IF(OR(C255=\"Fr\", C255=\"So\", AND(C255=\"Sr\", TODAY()<43646)), \"N/A\", \"No\")))","v":"Yes"}]
["Yuchen","Wang","Jr","YPW5144",{"$f":"COUNTIF(Event1!$D:$D, D256) + COUNTIF(Event2!$D:$D, D256) + COUNTIF(Event3!$D:$D, D256) + COUNTIF(Event4!$D:$D, D256) + COUNTIF(Event5!$D:$D, D256) + COUNTIF(Event6!$D:$D, D256) + COUNTIF(Event7!$D:$D, D256) + COUNTIF(Event8!$D:$D, D256) + COUNTIF(Event9!$D:$D, D256) + COUNTIF(Event10!$D:$D, D256) + COUNTIF(Event11!$D:$D, D256) + COUNTIF(Event12!$D:$D, D256) + COUNTIF(Event13!$D:$D, D256) + COUNTIF(Event14!$D:$D, D256) + COUNTIF(Event15!$D:$D, D256) + COUNTIF(Event16!$D:$D, D256) + COUNTIF(Event17!$D:$D, D256) + COUNTIF(Event18!$D:$D, D256) + COUNTIF(Event19!$D:$D, D256) + COUNTIF(Event20!$D:$D, D256) + COUNTIF(Event21!$D:$D, D256) + COUNTIF(Event22!$D:$D, D256) + COUNTIF(Event23!$D:$D, D256) + COUNTIF(Event24!$D:$D, D256) + COUNTIF(Event25!$D:$D, D256) + 0","v":0},{"$f":"IF(D256=\"\", \"\", IF(IFERROR(VLOOKUP(D256, Dues!D:D, 1, FALSE), \"\")=\"\", \"No\", \"Yes\"))","v":"No"},{"$f":"IF(D256=\"\", \"\", IF(IFERROR(VLOOKUP(D256, Interview!D:D, 1, FALSE), \"\")<>\"\", \"Yes\", IF(OR(C256=\"Fr\", C256=\"So\", AND(C256=\"Sr\", TODAY()<43646)), \"N/A\", \"No\")))","v":"Yes"}]
["Ziming","Wang","Jr","ZBW5087",{"$f":"COUNTIF(Event1!$D:$D, D257) + COUNTIF(Event2!$D:$D, D257) + COUNTIF(Event3!$D:$D, D257) + COUNTIF(Event4!$D:$D, D257) + COUNTIF(Event5!$D:$D, D257) + COUNTIF(Event6!$D:$D, D257) + COUNTIF(Event7!$D:$D, D257) + COUNTIF(Event8!$D:$D, D257) + COUNTIF(Event9!$D:$D, D257) + COUNTIF(Event10!$D:$D, D257) + COUNTIF(Event11!$D:$D, D257) + COUNTIF(Event12!$D:$D, D257) + COUNTIF(Event13!$D:$D, D257) + COUNTIF(Event14!$D:$D, D257) + COUNTIF(Event15!$D:$D, D257) + COUNTIF(Event16!$D:$D, D257) + COUNTIF(Event17!$D:$D, D257) + COUNTIF(Event18!$D:$D, D257) + COUNTIF(Event19!$D:$D, D257) + COUNTIF(Event20!$D:$D, D257) + COUNTIF(Event21!$D:$D, D257) + COUNTIF(Event22!$D:$D, D257) + COUNTIF(Event23!$D:$D, D257) + COUNTIF(Event24!$D:$D, D257) + COUNTIF(Event25!$D:$D, D257) + 0","v":0},{"$f":"IF(D257=\"\", \"\", IF(IFERROR(VLOOKUP(D257, Dues!D:D, 1, FALSE), \"\")=\"\", \"No\", \"Yes\"))","v":"No"},{"$f":"IF(D257=\"\", \"\", IF(IFERROR(VLOOKUP(D257, Interview!D:D, 1, FALSE), \"\")<>\"\", \"Yes\", IF(OR(C257=\"Fr\", C257=\"So\", AND(C257=\"Sr\", TODAY()<43646)), \"N/A\", \"No\")))","v":"Yes"}]
["Conor","Wilkinson","Jr","CGW5129",{"$f":"COUNTIF(Event1!$D:$D, D258) + COUNTIF(Event2!$D:$D, D258) + COUNTIF(Event3!$D:$D, D258) + COUNTIF(Event4!$D:$D, D258) + COUNTIF(Event5!$D:$D, D258) + COUNTIF(Event6!$D:$D, D258) + COUNTIF(Event7!$D:$D, D258) + COUNTIF(Event8!$D:$D, D258) + COUNTIF(Event9!$D:$D, D258) + COUNTIF(Event10!$D:$D, D258) + COUNTIF(Event11!$D:$D, D258) + COUNTIF(Event12!$D:$D, D258) + COUNTIF(Event13!$D:$D, D258) + COUNTIF(Event14!$D:$D, D258) + COUNTIF(Event15!$D:$D, D258) + COUNTIF(Event16!$D:$D, D258) + COUNTIF(Event17!$D:$D, D258) + COUNTIF(Event18!$D:$D, D258) + COUNTIF(Event19!$D:$D, D258) + COUNTIF(Event20!$D:$D, D258) + COUNTIF(Event21!$D:$D, D258) + COUNTIF(Event22!$D:$D, D258) + COUNTIF(Event23!$D:$D, D258) + COUNTIF(Event24!$D:$D, D258) + COUNTIF(Event25!$D:$D, D258) + 0","v":0},{"$f":"IF(D258=\"\", \"\", IF(IFERROR(VLOOKUP(D258, Dues!D:D, 1, FALSE), \"\")=\"\", \"No\", \"Yes\"))","v":"No"},{"$f":"IF(D258=\"\", \"\", IF(IFERROR(VLOOKUP(D258, Interview!D:D, 1, FALSE), \"\")<>\"\", \"Yes\", IF(OR(C258=\"Fr\", C258=\"So\", AND(C258=\"Sr\", TODAY()<43646)), \"N/A\", \"No\")))","v":"Yes"}]
["Zachary","Wooddell","Jr","ZTW5052",{"$f":"COUNTIF(Event1!$D:$D, D259) + COUNTIF(Event2!$D:$D, D259) + COUNTIF(Event3!$D:$D, D259) + COUNTIF(Event4!$D:$D, D259) + COUNTIF(Event5!$D:$D, D259) + COUNTIF(Event6!$D:$D, D259) + COUNTIF(Event7!$D:$D, D259) + COUNTIF(Event8!$D:$D, D259) + COUNTIF(Event9!$D:$D, D259) + COUNTIF(Event10!$D:$D, D259) + COUNTIF(Event11!$D:$D, D259) + COUNTIF(Event12!$D:$D, D259) + COUNTIF(Event13!$D:$D, D259) + COUNTIF(Event14!$D:$D, D259) + COUNTIF(Event15!$D:$D, D259) + COUNTIF(Event16!$D:$D, D259) + COUNTIF(Event17!$D:$D, D259) + COUNTIF(Event18!$D:$D, D259) + COUNTIF(Event19!$D:$D, D259) + COUNTIF(Event20!$D:$D, D259) + COUNTIF(Event21!$D:$D, D259) + COUNTIF(Event22!$D:$D, D259) + COUNTIF(Event23!$D:$D, D259) + COUNTIF(Event24!$D:$D, D259) + COUNTIF(Event25!$D:$D, D259) + 0","v":0},{"$f":"IF(D259=\"\", \"\", IF(IFERROR(VLOOKUP(D259, Dues!D:D, 1, FALSE), \"\")=\"\", \"No\", \"Yes\"))","v":"No"},{"$f":"IF(D259=\"\", \"\", IF(IFERROR(VLOOKUP(D259, Interview!D:D, 1, FALSE), \"\")<>\"\", \"Yes\", IF(OR(C259=\"Fr\", C259=\"So\", AND(C259=\"Sr\", TODAY()<43646)), \"N/A\", \"No\")))","v":"Yes"}]
["Zhendong","Xiao","Jr","ZPX5023",{"$f":"COUNTIF(Event1!$D:$D, D260) + COUNTIF(Event2!$D:$D, D260) + COUNTIF(Event3!$D:$D, D260) + COUNTIF(Event4!$D:$D, D260) + COUNTIF(Event5!$D:$D, D260) + COUNTIF(Event6!$D:$D, D260) + COUNTIF(Event7!$D:$D, D260) + COUNTIF(Event8!$D:$D, D260) + COUNTIF(Event9!$D:$D, D260) + COUNTIF(Event10!$D:$D, D260) + COUNTIF(Event11!$D:$D, D260) + COUNTIF(Event12!$D:$D, D260) + COUNTIF(Event13!$D:$D, D260) + COUNTIF(Event14!$D:$D, D260) + COUNTIF(Event15!$D:$D, D260) + COUNTIF(Event16!$D:$D, D260) + COUNTIF(Event17!$D:$D, D260) + COUNTIF(Event18!$D:$D, D260) + COUNTIF(Event19!$D:$D, D260) + COUNTIF(Event20!$D:$D, D260) + COUNTIF(Event21!$D:$D, D260) + COUNTIF(Event22!$D:$D, D260) + COUNTIF(Event23!$D:$D, D260) + COUNTIF(Event24!$D:$D, D260) + COUNTIF(Event25!$D:$D, D260) + 0","v":0},{"$f":"IF(D260=\"\", \"\", IF(IFERROR(VLOOKUP(D260, Dues!D:D, 1, FALSE), \"\")=\"\", \"No\", \"Yes\"))","v":"No"},{"$f":"IF(D260=\"\", \"\", IF(IFERROR(VLOOKUP(D260, Interview!D:D, 1, FALSE), \"\")<>\"\", \"Yes\", IF(OR(C260=\"Fr\", C260=\"So\", AND(C260=\"Sr\", TODAY()<43646)), \"N/A\", \"No\")))","v":"Yes"}]
["Zhengyuan","Xu","Jr","ZKX5016",{"$f":"COUNTIF(Event1!$D:$D, D261) + COUNTIF(Event2!$D:$D, D261) + COUNTIF(Event3!$D:$D, D261) + COUNTIF(Event4!$D:$D, D261) + COUNTIF(Event5!$D:$D, D261) + COUNTIF(Event6!$D:$D, D261) + COUNTIF(Event7!$D:$D, D261) + COUNTIF(Event8!$D:$D, D261) + COUNTIF(Event9!$D:$D, D261) + COUNTIF(Event10!$D:$D, D261) + COUNTIF(Event11!$D:$D, D261) + COUNTIF(Event12!$D:$D, D261) + COUNTIF(Event13!$D:$D, D261) + COUNTIF(Event14!$D:$D, D261) + COUNTIF(Event15!$D:$D, D261) + COUNTIF(Event16!$D:$D, D261) + COUNTIF(Event17!$D:$D, D261) + COUNTIF(Event18!$D:$D, D261) + COUNTIF(Event19!$D:$D, D261) + COUNTIF(Event20!$D:$D, D261) + COUNTIF(Event21!$D:$D, D261) + COUNTIF(Event22!$D:$D, D261) + COUNTIF(Event23!$D:$D, D261) + COUNTIF(Event24!$D:$D, D261) + COUNTIF(Event25!$D:$D, D261) + 0","v":0},{"$f":"IF(D261=\"\", \"\", IF(IFERROR(VLOOKUP(D261, Dues!D:D, 1, FALSE), \"\")=\"\", \"No\", \"Yes\"))","v":"No"},{"$f":"IF(D261=\"\", \"\", IF(IFERROR(VLOOKUP(D261, Interview!D:D, 1, FALSE), \"\")<>\"\", \"Yes\", IF(OR(C261=\"Fr\", C261=\"So\", AND(C261=\"Sr\", TODAY()<43646)), \"N/A\", \"No\")))","v":"Yes"}]
["Aoshu","Zhang","Jr","AXZ31",{"$f":"COUNTIF(Event1!$D:$D, D262) + COUNTIF(Event2!$D:$D, D262) + COUNTIF(Event3!$D:$D, D262) + COUNTIF(Event4!$D:$D, D262) + COUNTIF(Event5!$D:$D, D262) + COUNTIF(Event6!$D:$D, D262) + COUNTIF(Event7!$D:$D, D262) + COUNTIF(Event8!$D:$D, D262) + COUNTIF(Event9!$D:$D, D262) + COUNTIF(Event10!$D:$D, D262) + COUNTIF(Event11!$D:$D, D262) + COUNTIF(Event12!$D:$D, D262) + COUNTIF(Event13!$D:$D, D262) + COUNTIF(Event14!$D:$D, D262) + COUNTIF(Event15!$D:$D, D262) + COUNTIF(Event16!$D:$D, D262) + COUNTIF(Event17!$D:$D, D262) + COUNTIF(Event18!$D:$D, D262) + COUNTIF(Event19!$D:$D, D262) + COUNTIF(Event20!$D:$D, D262) + COUNTIF(Event21!$D:$D, D262) + COUNTIF(Event22!$D:$D, D262) + COUNTIF(Event23!$D:$D, D262) + COUNTIF(Event24!$D:$D, D262) + COUNTIF(Event25!$D:$D, D262) + 0","v":0},{"$f":"IF(D262=\"\", \"\", IF(IFERROR(VLOOKUP(D262, Dues!D:D, 1, FALSE), \"\")=\"\", \"No\", \"Yes\"))","v":"No"},{"$f":"IF(D262=\"\", \"\", IF(IFERROR(VLOOKUP(D262, Interview!D:D, 1, FALSE), \"\")<>\"\", \"Yes\", IF(OR(C262=\"Fr\", C262=\"So\", AND(C262=\"Sr\", TODAY()<43646)), \"N/A\", \"No\")))","v":"Yes"}]
["Yichi","Zhang","Jr","YXZ362",{"$f":"COUNTIF(Event1!$D:$D, D263) + COUNTIF(Event2!$D:$D, D263) + COUNTIF(Event3!$D:$D, D263) + COUNTIF(Event4!$D:$D, D263) + COUNTIF(Event5!$D:$D, D263) + COUNTIF(Event6!$D:$D, D263) + COUNTIF(Event7!$D:$D, D263) + COUNTIF(Event8!$D:$D, D263) + COUNTIF(Event9!$D:$D, D263) + COUNTIF(Event10!$D:$D, D263) + COUNTIF(Event11!$D:$D, D263) + COUNTIF(Event12!$D:$D, D263) + COUNTIF(Event13!$D:$D, D263) + COUNTIF(Event14!$D:$D, D263) + COUNTIF(Event15!$D:$D, D263) + COUNTIF(Event16!$D:$D, D263) + COUNTIF(Event17!$D:$D, D263) + COUNTIF(Event18!$D:$D, D263) + COUNTIF(Event19!$D:$D, D263) + COUNTIF(Event20!$D:$D, D263) + COUNTIF(Event21!$D:$D, D263) + COUNTIF(Event22!$D:$D, D263) + COUNTIF(Event23!$D:$D, D263) + COUNTIF(Event24!$D:$D, D263) + COUNTIF(Event25!$D:$D, D263) + 0","v":0},{"$f":"IF(D263=\"\", \"\", IF(IFERROR(VLOOKUP(D263, Dues!D:D, 1, FALSE), \"\")=\"\", \"No\", \"Yes\"))","v":"No"},{"$f":"IF(D263=\"\", \"\", IF(IFERROR(VLOOKUP(D263, Interview!D:D, 1, FALSE), \"\")<>\"\", \"Yes\", IF(OR(C263=\"Fr\", C263=\"So\", AND(C263=\"Sr\", TODAY()<43646)), \"N/A\", \"No\")))","v":"Yes"}]
["Nicholas","Zuchelli","Jr","NQZ5067",{"$f":"COUNTIF(Event1!$D:$D, D264) + COUNTIF(Event2!$D:$D, D264) + COUNTIF(Event3!$D:$D, D264) + COUNTIF(Event4!$D:$D, D264) + COUNTIF(Event5!$D:$D, D264) + COUNTIF(Event6!$D:$D, D264) + COUNTIF(Event7!$D:$D, D264) + COUNTIF(Event8!$D:$D, D264) + COUNTIF(Event9!$D:$D, D264) + COUNTIF(Event10!$D:$D, D264) + COUNTIF(Event11!$D:$D, D264) + COUNTIF(Event12!$D:$D, D264) + COUNTIF(Event13!$D:$D, D264) + COUNTIF(Event14!$D:$D, D264) + COUNTIF(Event15!$D:$D, D264) + COUNTIF(Event16!$D:$D, D264) + COUNTIF(Event17!$D:$D, D264) + COUNTIF(Event18!$D:$D, D264) + COUNTIF(Event19!$D:$D, D264) + COUNTIF(Event20!$D:$D, D264) + COUNTIF(Event21!$D:$D, D264) + COUNTIF(Event22!$D:$D, D264) + COUNTIF(Event23!$D:$D, D264) + COUNTIF(Event24!$D:$D, D264) + COUNTIF(Event25!$D:$D, D264) + 0","v":0},{"$f":"IF(D264=\"\", \"\", IF(IFERROR(VLOOKUP(D264, Dues!D:D, 1, FALSE), \"\")=\"\", \"No\", \"Yes\"))","v":"No"},{"$f":"IF(D264=\"\", \"\", IF(IFERROR(VLOOKUP(D264, Interview!D:D, 1, FALSE), \"\")<>\"\", \"Yes\", IF(OR(C264=\"Fr\", C264=\"So\", AND(C264=\"Sr\", TODAY()<43646)), \"N/A\", \"No\")))","v":"Yes"}]
["Tianhao","Wang","Jr","tvw5292",{"$f":"COUNTIF(Event1!$D:$D, D265) + COUNTIF(Event2!$D:$D, D265) + COUNTIF(Event3!$D:$D, D265) + COUNTIF(Event4!$D:$D, D265) + COUNTIF(Event5!$D:$D, D265) + COUNTIF(Event6!$D:$D, D265) + COUNTIF(Event7!$D:$D, D265) + COUNTIF(Event8!$D:$D, D265) + COUNTIF(Event9!$D:$D, D265) + COUNTIF(Event10!$D:$D, D265) + COUNTIF(Event11!$D:$D, D265) + COUNTIF(Event12!$D:$D, D265) + COUNTIF(Event13!$D:$D, D265) + COUNTIF(Event14!$D:$D, D265) + COUNTIF(Event15!$D:$D, D265) + COUNTIF(Event16!$D:$D, D265) + COUNTIF(Event17!$D:$D, D265) + COUNTIF(Event18!$D:$D, D265) + COUNTIF(Event19!$D:$D, D265) + COUNTIF(Event20!$D:$D, D265) + COUNTIF(Event21!$D:$D, D265) + COUNTIF(Event22!$D:$D, D265) + COUNTIF(Event23!$D:$D, D265) + COUNTIF(Event24!$D:$D, D265) + COUNTIF(Event25!$D:$D, D265) + 0","v":0},{"$f":"IF(D265=\"\", \"\", IF(IFERROR(VLOOKUP(D265, Dues!D:D, 1, FALSE), \"\")=\"\", \"No\", \"Yes\"))","v":"No"},{"$f":"IF(D265=\"\", \"\", IF(IFERROR(VLOOKUP(D265, Interview!D:D, 1, FALSE), \"\")<>\"\", \"Yes\", IF(OR(C265=\"Fr\", C265=\"So\", AND(C265=\"Sr\", TODAY()<43646)), \"N/A\", \"No\")))","v":"Yes"}]
["Thomas","Reif","Jr","tjr5576",{"$f":"COUNTIF(Event1!$D:$D, D266) + COUNTIF(Event2!$D:$D, D266) + COUNTIF(Event3!$D:$D, D266) + COUNTIF(Event4!$D:$D, D266) + COUNTIF(Event5!$D:$D, D266) + COUNTIF(Event6!$D:$D, D266) + COUNTIF(Event7!$D:$D, D266) + COUNTIF(Event8!$D:$D, D266) + COUNTIF(Event9!$D:$D, D266) + COUNTIF(Event10!$D:$D, D266) + COUNTIF(Event11!$D:$D, D266) + COUNTIF(Event12!$D:$D, D266) + COUNTIF(Event13!$D:$D, D266) + COUNTIF(Event14!$D:$D, D266) + COUNTIF(Event15!$D:$D, D266) + COUNTIF(Event16!$D:$D, D266) + COUNTIF(Event17!$D:$D, D266) + COUNTIF(Event18!$D:$D, D266) + COUNTIF(Event19!$D:$D, D266) + COUNTIF(Event20!$D:$D, D266) + COUNTIF(Event21!$D:$D, D266) + COUNTIF(Event22!$D:$D, D266) + COUNTIF(Event23!$D:$D, D266) + COUNTIF(Event24!$D:$D, D266) + COUNTIF(Event25!$D:$D, D266) + 0","v":0},{"$f":"IF(D266=\"\", \"\", IF(IFERROR(VLOOKUP(D266, Dues!D:D, 1, FALSE), \"\")=\"\", \"No\", \"Yes\"))","v":"No"},{"$f":"IF(D266=\"\", \"\", IF(IFERROR(VLOOKUP(D266, Interview!D:D, 1, FALSE), \"\")<>\"\", \"Yes\", IF(OR(C266=\"Fr\", C266=\"So\", AND(C266=\"Sr\", TODAY()<43646)), \"N/A\", \"No\")))","v":"Yes"}]

{"sheet":"Instructions","index":2,"n_rows":11,"n_cols":4,"rows_kept":11,"cut":false,"hidden":true,"merged":[[1,0,1,12]]}
["Operation instructions:"]
["- Enter new events on new sheets.  Make a new sheet by copying an old sheet and renaming it Eventx, where x is the next sequential event number.\n- Specify each event's name and date.  Attendance will autofill.\n- Check that no one entered their full email address in the ID field.  Also check that class standings are all in the correct abbreviations.\n- Before updating points, make sure to enter the date you are updating and the total number of events that are being counted in the yellow area at the top."]
[]
[]
["Levels"]
["Reach 2 points, ","Pay dues, ","Do a Mock Interview, ","and do this by the career fair to be in October resume book and be considered club member"]
["Reach 2 points, ","Pay dues, ","Do a Mock Interview, ","and as soon as you do you can be in the resume book and be considered a club member"]
["Reach 5 points, ","Pay dues, ","Do a Mock Interview, ","allowing you to be in resume book in September 2019 (you're eligible for the resume book until then)"]
["Reach 10 points, ","Pay dues, ","Do a Mock Interview, ","allowing you to receive special recognition in resume book beginning spring 2019"]
["Reach 15 points, ","Pay dues, ","Do a Mock Interview, ","allowing you to qualify for special networking event in fall 2019"]
["Keep up the good work!"]

{"sheet":"Dues","index":3,"n_rows":643,"n_cols":4,"rows_kept":643,"cut":false,"hidden":true,"merged":[]}
["Event: ","Dues"]
["Date:","2018-09-22","<- Date last updated"]
["Attendance:",{"$f":"COUNTA(D6:D499)","v":170}]
[]
["First","Last","Year","ID"]
["Shiva","Alladi","Sr","ssa5254"]
["Kody","Allen","Jr","kla5319"]
["Alex","Arena","Jr","afa5399"]
["Colby","Aument","Fr","cga5095"]
["Geoffrey","Barratt","Fr","gxb92"]
["Kurt","Baurle","Sr","kmb6692"]
["Paul","Birch","Sr","pvb5171"]
["Ethan","Cai","Fr","wvc5264"]
["Matthew","Cash","So","mdc5571"]
["Kevin","Chow","Sr ","kbc5228"]
["Iris","Chow","Sr ","kbc5228"]
["Alexis","Coleman","So","akc5641"]
["O'Connell","Collin","So","cpo5122"]
["Beckett","Cromer","Sr","bdc5221"]
["Jennifer","Davis","So","jrd5822"]
["Peter","DeMallie","So","prd5123"]
["Mitch","Detwiler","So","mxd5561"]
["Maya","DiGirolamo","Fr","mvd5783"]
["Tyler","Dolan","Fr","tmd5648"]
["Sabrina","Garcia","Sr","sqg5499"]
["Taylor","Geppert","Fr","stg5184"]
["Kara","Gibbon","Fr","kxg295"]
["Paige","Glover","Fr","pag5319"]
["Alex","Hartman","So","auh363"]
["Alex","Hartman","So","auh363"]
["Frankie","Haver","Jr","fph5023"]
["Ryan","Hazel","So","rxh378"]
["Maria","Howe","Fr","mrh64"]
["Paige","Hughes","So","plh5156"]
["Kari","Huth","Sr","kvh5221"]
["Drew","Insley","Fr","dki5019"]
["Danielle","Jameison","Sr","dkj5101"]
["Yixiao","Jiang","Jr","yxj38"]
["Konrad","Kai","Fr","Kwk5449"]
["Konner","Krueger","Jr","kjk5709"]
["Zhaoxin","Liang","Fr","zfl5166"]
["Zhiyang","Liang","Fr","zfl5166"]
["Holly","Linkoski","Sr","hal5157"]
["Elysia","Liu","Jr","yxl482"]
["Kevin","Logan","So","ktl5134"]
["Raymond","Lu","So","lmr5640"]
["Dante","Marcucci","Fr","uum99"]
["Vince","Melchiorre","Fr","vzm35"]
["Erica","Mills","So","ekm5337"]
["Nick","Mirandi","Fr","nxm5386"]
["Nathan","Newman","So","ngn5017"]
["Jacob","Niedermayer","Jr","jtn5161"]
["Anu","Ogunrombi","Sr","aso5104"]
["Jiasheng","Pan","Jr","jmp6546"]
["Krystie","Perez-Morales","So","knp5260"]
["Thomas","Piccari","Sr","tvp5216"]
["Matt","Pidgeon","So","mpp5454"]
["Ryan","Pityk","So","rxp5323"]
["Jaccob","Rausch","Fr","jmr6884"]
["Jordan","Reiter","Jr","jar6334"]
["Lucas","Richardsen","Fr","ljr5433"]
["joseph","roantree","So","jzr98"]
["Blake","Rohrbacher","Jr","bkr5178"]
["Chris","Scalies","Fr","cjs6819"]
["Bradley","Shafer","So","bxs437"]
["Nikolas","Steacker","Fr","nps5409"]
["Justin","Strecker","Jr","jxs6288"]
["Yanan","Sun","Jr","yzs70"]
["Kevin","Suryanto","Jr","kas7146"]
["Alexa","Tannenbaum","Fr","aqt5407"]
["Julia","Trigg","So","jxt5423"]
["Qiaojuan","Tu","Fr ","qkt5010"]
["Carmen","Veltri","Fr","cpv5095"]
["Vince","Birch","Fr","vpb5085"]
["Patrick","Voss","Fr","puv44"]
["Ryan","Voyack","Sr","rjv5140"]
["Jake","Wagner","Fr","jfw5541"]
["Yiding","Wang","Fr","ckw5354"]
["chunxu","wang","Fr","ckw5354"]
["Kelly","Waters","So","kfw5153"]
["Greg","Westfall","Fr","gvw5064"]
["Kevin","Westfall","Fr","gvw5064"]
["Morgan","Wetzel","Sr","maw5942"]
["Mingyin","Xie","So","mvx5050"]
["Sunrunyi","Yuan","So ","spy5117"]
["Chaoyi","Zhu","Jr","cxz94"]
["Eric","Zi","Fr","gzz5074"]
["Kevin","Andrian","Jr","kas7146"]
["Colby","Aument","Fr","cga5095"]
["Brooke","Barrett","Sr","blb5681"]
["Bokai","Chen","So","ymc5216"]
["Yuxin","Chen","So","ymc5216"]
["Brandon","Crawford","So","bmc5819"]
["Nick","Dingman","Fr","nvd5236"]
["Haobo","Fan","Fr","hmf5251"]
["Felishia","Felishia","So","ffn5018"]
["Ethan","Frederick","Sr","esf5093"]
["Lily","Han","So","rvh5387"]
["Caroline","Johnson","Jr","crj5193"]
["Claudia","Jung","Jr","cjj5206"]
["Sean","Klavans","Jr","sak5707"]
["Kabir","Kohli","Jr","kxk338"]
["Vickia","Lai","Jr","jzl38"]
["Daniel","Marinelli","Fr","dbm5481"]
["Kyle","Mauger","So","kjm6235"]
["Matthew","McClintick","Fr","mjm7869"]
["Grace","McStravock","Jr","gvm5232"]
["Jon","Mumford","So","jbm5733"]
["Brent","Nachison","Jr","bjn5158"]
["Nicolette","Nybro","So","nan5101"]
["Collin","O'Connell","So","cpo5122"]
["Akash","Patel","So","axp428"]
["Emily","Price","Sr","emp5391"]
["Will","Stephens","Fr","whs5100"]
["Mei Ying","Tan","Sr","mut77"]
["Kevin","West","Fr","gvw5064"]
["Jeremy","Williams","Jr","jsw5439"]
["David","Wooditch","Jr","dmw5806"]
["Vera","Xia","Sr","xzx5081"]
["Longhao","Yang","So","lky5069"]
["Hanlin","Zhang","Fr","hbz5102"]
["Mathilde ","Hsia","Sr","mfh5323"]
["Siyi ","Ma","Jr","sbm5554"]
["Yu ","Luo","Jr","yml5242"]
["Ruby ","Zhang","Fr","hbz5102"]
["Allison ","Seibert","Jr","azs6047"]
["Troy ","Harro","Jr","tbh5102"]
["Ryan ","Hannon","Sr","rjh5595"]
["Molly ","Groarke","So","mag6298"]
["Shannon ","Cikowski","Jr","spc5519"]
["Qin ","Zhang","Fr","hbz5102"]
["Michael ","Gordon","Sr","mjg5847"]
["Jake ","Wiley","Jr","jrw5844"]
["Duong ","Nguyen","Jr","dnn5"]
["Atharv ","Gupte","Jr","abg5424"]
["Mallory ","Beard","Jr","mmb6124"]
["Rohan ","Bhandarkar","Jr","rpb5416"]
["Lisa ","Winters","Sr","lvw5155"]
["Ilsa ","Smith","So","ivs5154"]
["Taras ","Guanowsky","Jr","txg206"]
["Ryan ","Podufal","SR","rwp5337"]
["Ming ","Chen","So","ymc5216"]
["Michael ","Callahan","Sr","mgc5166"]
["Lu ","Huang","Jr","lph5179"]
["Josh ","Goldstein","Sr","jjg5636"]
["Zhengyan ","Yuan","So ","spy5117"]
["Tianlang ","Li","Jr","HPL5120"]
["Weilun ","Zhang","Fr","hbz5102"]
["Aaron ","Gersh","Jr","arg5600"]
["Marko ","Resetar","Sr","mvr5349"]
["Connor ","Grabowski","Jr","ctg5142"]
["Nathan ","Miller","Jr","jdm6057"]
["Henry ","Ning","Sr","hon101"]
["Amanda","Shuter","Sr","axs6075"]
["Michael ","Roby","Jr","msr5385"]
["Evan ","Rerecich","Sr","emr5498"]
["TJ ","McIntyre","Jr","tjm6163"]
["Rachel ","Weber","Jr","rhw5080"]
["Judy ","Kahn","Jr","jbk5410"]
["Kunjal ","Kapadia","Fr","kxk5613"]
["Joe ","Esch","Sr","jze5187"]
["Yang ","Gao","Jr","yug61"]
["Joseph ","Kaverman","So","jmk6605"]
["Courtney ","Cherry","Jr","clc5887"]
["Brian ","Garbacik","Fr","brg16"]
["Liam ","Richards","Sr","lrr5177"]
["Emma ","Wu","Sr","tbw5119"]
["Noah ","Donten","So","nmd5348"]
["Ziming ","Wang","Fr","ckw5354"]
["Aidan ","Lake","So","arl5600"]
["Juliette ","van Schaik","Jr","jiv5171"]
["Elizabeth ","Simmons","Jr","ems6139"]
["Zachary ","Wenning","Fr","zrw5043"]
["Jiali ","Liu","Jr","yxl482"]
["Haozheng","Chen","So","ymc5216"]
[]
[]
[]
[]
[]
[]
[]
[]
[]
[]
[]
[]
[]
[]
[]
[]
[]
[]
[]
[]
[]
[]
[]
[]
[]
[]
[]
[]
[]
[]
[]
[]
[]
[]
[]
[]
[]
[]
[]
[]
[]
[]
[]
[]
[]
[]
[]
[]
[]
[]
[]
[]
[]
[]
[]
[]
[]
[]
[]
[]
[]
[]
[]
[]
[]
[]
[]
[]
[]
[]
[]
[]
[]
[]
[]
[]
[]
[]
[]
[]
[]
[]
[]
[]
[]
[]
[]
[]
[]
[]
[]
[]
[]
[]
[]
[]
[]
[]
[]
[]
[]
[]
[]
[]
[]
[]
[]
[]
[]
[]
[]
[]
[]
[]
[]
[]
[]
[]
[]
[]
[]
[]
[]
[]
[]
[]
[]
[]
[]
[]
[]
[]
[]
[]
[]
[]
[]
[]
[]
[]
[]
[]
[]
[]
[]
[]
[]
[]
[]
[]
[]
[]
[]
[]
[]
[]
[]
[]
[]
[]
[]
[]
[]
[]
[]
[]
[]
[]
[]
[]
[]
[]
[]
[]
[]
[]
[]
[]
[]
[]
[]
[]
[]
[]
[]
[]
[]
[]
[]
[]
[]
[]
[]
[]
[]
[]
[]
[]
[]
[]
[]
[]
[]
[]
[]
[]
[]
[]
[]
[]
[]
[]
[]
[]
[]
[]
[]
[]
[]
[]
[]
[]
[]
[]
[]
[]
[]
[]
[]
[]
[]
[]
[]
[]
[]
[]
[]
[]
[]
[]
[]
[]
[]
[]
[]
[]
[]
[]
[]
[]
[]
[]
[]
[]
[]
[]
[]
[]
[]
[]
[]
[]
[]
[]
[]
[]
[]
[]
[]
[]
[]
[]
[]
[]
[]
[]
[]
[]
[]
[]
[]
[]
[]
[]
[]
[]
[]
[]
[]
[]
[]
[]
[]
[]
[]
[]
[]
[]
[]
[]
[]
[]
[]
[]
[]
[]
[]
[]
[]
[]
[]
[]
[]
[]
[]
[]
[]
[]
[]
[]
[]
[]
[]
[]
[]
[]
[]
[]
[]
[]
[]
[]
[]
[]
[]
[]
[]
[]
[]
[]
[]
[]
[]
[]
[]
[]
[]
[]
[]
[]
[]
[]
[]
[]
[]
[]
[]
[]
[]
[]
[]
[]
[]
[]
[]
[]
[]
[]
[]
[]
[]
[]
[]
[]
[]
[]
[]
[]
[]
[]
[]
[]
[]
[]
[]
[]
[]
[]
[]
[]
[]
[]
[]
[]
[]
[]
[]
[]
[]
[]
[]
[]
[]
[]
[]
[]
[]
[]
[]
[]
[]
[]
[]
[]
[]
[]
[]
[]
[]
[]
[]
[]
[]
[]
[]
[]
[]
[]
[]
[]
[]
[]
[]
[]
[]
[]
[]
[]
[]
[]
[]
[]
[]
[]
[]
[]
[]
[]
[]
[]
[]
[]
[]
[]
[]
[]
[]
[]
[]
[]
[]
[]
[]
[]
[null,null,null,{"$f":"IFERROR(INDEX(#REF!,MATCH(B640,#REF!,0)),\" \")","v":" "}]
[null,null,null,{"$f":"IFERROR(INDEX(#REF!,MATCH(B641,#REF!,0)),\" \")","v":" "}]
[null,null,null,{"$f":"IFERROR(INDEX(#REF!,MATCH(B642,#REF!,0)),\" \")","v":" "}]
[null,null,null,{"$f":"IFERROR(INDEX(#REF!,MATCH(B643,#REF!,0)),\" \")","v":" "}]

{"sheet":"Interview","index":4,"n_rows":101,"n_cols":4,"rows_kept":101,"cut":false,"hidden":true,"merged":[]}
["Event: ","Mock Interview"]
["Date:","2018-09-03"]
["Attendance:",{"$f":"COUNTA(D6:D206)","v":96}]
[]
["First","Last","Year","ID"]
["Kody","Allen","Jr","KLA5319"]
["Kimberly","Anderson","Jr","KSA5170"]
["Alexander","Arena","Jr","AFA5399"]
["Ahmad Mohd","Azhar","Jr","AQM6158"]
["Mallory","Beard","Jr","MMB6124"]
["Margot","California","Jr","MAC6866"]
["Alexis","Carp","Jr","AMC7067"]
["Shumin","Chen","Jr","QUC54"]
["Ying","Chen","Jr","YMC5189"]
["Courtney","Cherry","Jr","CLC5887"]
["Shannon","Cikowski","Jr","SPC5519"]
["Olivia","Dalby","Jr","OPD5013"]
["Alexis","Dobransky","Jr","ALD5655"]
["Kyle","Dougherty","Jr","KJD5424"]
["Mayting","Feng","Jr","MUF72"]
["Yang","Gao","Jr","YUG61"]
["Aaron","Gersh","Jr","ARG5600"]
["Connor","Grawbowski","Jr","ctg5142"]
["Taras","Guanowsky","Jr","TXG206"]
["Atharv","Gupte","Jr","ABG5424"]
["Zhiyi","Han","Jr","ZVH5145"]
["Muhamad Hadi","Haridan","Jr","MFH5449"]
["Troy","Harro","Jr","TBH5102"]
["Frankie","Haver","Jr","FPH5023"]
["Rebecca","Hobman","Jr","RBH5207"]
["Yixiao","Jiang","Jr","YXJ38"]
["Caroline","Johnson","Jr","CRJ5193"]
["Claudia Ho Yan","Jung","Jr","CJJ5206"]
["Judith","Kahn","Jr","JBK5410"]
["Sean","Klavans","Jr","SAK5707"]
["Konner","Krueger","Jr","KJK5709"]
["Jiaqi","Lai","Jr","JZL38"]
["Mitchell","Ledven","Jr","MRL5449"]
["Hanzhang","Li","Jr","HPL5120"]
["Heming","Liu","Jr","HXL335"]
["Yixuan","Liu","Jr","YXL482"]
["Hao","Lu","Jr","hfl5046"]
["Jiayu","Luo","Jr","JZL299"]
["Xijia","Luo","Jr","XKL5056"]
["Yu","Luo","Jr","YML5242"]
["Siyi","Ma","Jr","SBM5554"]
["Lang","Mai","Jr","LUM95"]
["Twinkle","Malhotra","Jr","TZM5406"]
["Marina","Mautner Wizentier","Jr","MQM6104"]
["Alexandra","Mccormack","Jr","AVM5978"]
["Grace","Mcstravock","Jr","GVM5232"]
["John","Miller","Jr","JDM6057"]
["Nathan","Miller","Jr","NJM5536"]
["Chunlan","Mo","Jr","CXM981"]
["Iffah","Mohamad Saufi","Jr","IVM5141"]
["Brent","Nachison","Jr","BJN5158"]
["Duong (Willow)","Nguyen","Jr","dnn5"]
["Jacob","Niedermayer","Jr","JTN5161"]
["Emma Lee","Parvess","Jr","EMP5462"]
["Kiera","Pawlikowsky","Jr","KJP5515"]
["Nathan","Putt","Jr","NRP5173"]
["Alia","Razali","Jr","AUR268"]
["Jordan","Reiter","Jr","JAR6334"]
["Michael","Roby","Jr","MSR5385"]
["Blake","Rohrbacher","Jr","BKR5178"]
["Allison","Seibert","Jr","AZS6047"]
["Zhengyang","Shan","Jr","ZJS5170"]
["Amanda May","Shuter","Jr","axs6075"]
["Justin","Strecker","Jr","JXS6288"]
["Rachel","Sudo","Jr","RBS5427"]
["Helin","Sui","Jr","HZS58"]
["Yanan","Sun","Jr","YZS70"]
["Rebekah","Thompson","Jr","RGT5044"]
["Ruxin","Tong","Jr","RXT26"]
["Juliette","Van Schaik","Jr","JIV5171"]
["Yiding","Wang","Jr","YZW164"]
["Yuchen","Wang","Jr","YPW5144"]
["Ziming","Wang","Jr","ZBW5087"]
["Rachel","Weber","Jr","RHW5080"]
["Jake","Wiley","Jr","JRW5844"]
["Conor","Wilkinson","Jr","CGW5129"]
["Zachary","Wooddell","Jr","ZTW5052"]
["Zhendong","Xiao","Jr","ZPX5023"]
["Zhengyuan","Xu","Jr","ZKX5016"]
["Aoshu","Zhang","Jr","AXZ31"]
["Qin","Zhang","Jr","QFZ5029"]
["Yichi","Zhang","Jr","YXZ362"]
["Zihan","Zhang","Jr","ZUZ161"]
["Nicholas","Zuchelli","Jr","NQZ5067"]
["Julia","Trigg","Jr","jxt5423"]
["Tianhao","Wang","Jr","tvw5292"]
["Akash","Patel","Jr","axp428"]
["Thomas","Reif","Jr","tjr5576"]
["Dante","Marcucci","Jr","uum99"]
["Kevin","Logan","Jr","ktl5134"]
["Jacob","Rausch","Jr","jmr6884"]
["David","Wooditch","Jr","dmw5806"]
["Matt","Pidgeon","Jr","mpp5454"]
["Rohan","Bhandarkar","Jr","rpb5416"]
["Huiyang","Ding","Jr","hvd5093"]
["Kevin","Suryanto","Jr","kas7146"]

{"sheet":"Event25","index":5,"n_rows":20,"n_cols":4,"rows_kept":20,"cut":false,"hidden":true,"merged":[]}
["Event:","Erie Insurance"]
["Date:","2018-09-17"]
["Attendance:",15]
[]
["First Name","Last Name","Year","PSU ID (ex. abc1234)"]
["Chaoyi","Zhu","Jr","cxz94"]
["Atharv","Gupte","Jr","abg5424"]
["tingting","wu","Sr","tbw5119"]
["Brent","Nachison","Jr","bjn5158"]
["Marceli","Palikowski","So","mzp5569"]
["Shannon","Cikowski","Jr","spc5519"]
["Courtney","Cherry","Jr","clc5887"]
["Judy","Kahn","Jr","jbk5410"]
["Taras","Guanowsky","Jr","txg206"]
["Duong","Nguyen","Jr","dnn5"]
["Kara","Gibbon","Fr","kxg295"]
["Amanda","Shuter","Sr","axs6075"]
["Rachel","Sudo","Jr","rbs5427"]
["Alex","Ventrello","Sr","acv5091"]
["Joseph","Kaverman","So","jmk6605"]

{"sheet":"Event24","index":6,"n_rows":23,"n_cols":4,"rows_kept":23,"cut":false,"hidden":true,"merged":[]}
["Event:","NYL"]
["Date:","2018-09-17"]
["Attendance:",18]
[]
["First Name","Last Name","Year","PSU ID (ex. abc1234)"]
["Dante","Marcucci","So","uum99"]
["Yu","Luo","Jr","yml5242"]
["Mei Ying","Tan","Sr","mut77"]
["Akram","Khan","Sr","ayk5511"]
["John","Miller","Jr","jdm6057"]
["Lu","Huang","Jr","lph5179"]
["Valentina","Miroshevskaia","Sr","vvm5126"]
["Kara","Gibbon","Fr","kxg295"]
["Atharv","Gupte","Jr","abg5424"]
["Amanda","Shuter","Sr","axs6075"]
["Joseph","Sukunda","Sr","jhs5325"]
["Chaoyi","Zhu","Jr","cxz94"]
["Nicolette","Nybro","So","nan5101"]
["Marceli","Pawlikowki","So","mzp5569"]
["mingzhang","yan","Sr","mxy5097"]
["tingting","wu","Sr","tbw5119"]
["Di Fan","Zheng","Sr","dmz5099"]
["Shiva","Alladi","Sr","ssa5254"]

{"sheet":"Event23","index":7,"n_rows":13,"n_cols":4,"rows_kept":13,"cut":false,"hidden":true,"merged":[]}
["Event:","Lunch with Leaders"]
["Date:","2018-09-14"]
["Attendance:",{"$f":"COUNTA(B6:B30)","v":8}]
[]
["First Name","Last Name","Year","PSU ID (ex. abc1234)"]
["Nicke","Mirandi","Fr","nxm5386"]
["Zhengyan","Yuan","Jr","zqy5133"]
["Marko","Resetar","Sr","mvr5349"]
["Qin","Zhang","Jr","qfz5029"]
["Gary","Modzelewski","Jr","gam5292"]
["Elysia","Liu","Jr","yxl482"]
["Geoffrey","Barratt","Fr","gxb92"]
["Duong","Nguyen","Jr","dnn5"]

{"sheet":"Event22","index":8,"n_rows":30,"n_cols":4,"rows_kept":30,"cut":false,"hidden":true,"merged":[]}
["Event:","Aon Info Session"]
["Date:","2018-09-17"]
["Attendance:",{"$f":"COUNTA(B6:B30)","v":25}]
[]
["First Name","Last Name","Year","PSU ID (ex. abc1234)"]
["Ethan","Frederick","Sr","esf5093"]
["Joe","Esch","Sr","jze5187"]
["Brent","Nachison","Jr","bjn5158"]
["Judy","Kahn","Jr","jbk5410"]
["Margot","California","Jr","mac6866"]
["Amanda","Shuter","Sr","axs6075"]
["Michael","Gordon","Sr","mjg5847"]
["Taras","Guanowsky","Jr","txg206"]
["Zijing","Cui","Sr","zjc5108"]
["Akram","Khan","Sr","ayk5511"]
["Zhengyan","Yuan","Jr","zqy5133"]
["Jacob","Niedermayer","Jr","jtn5161"]
["Nicolette","Nybro","So","nan5101"]
["Tingting","Wu","Sr","tbw5119"]
["Lu","Huang","Jr","lph5179"]
["Duong","Nguyen","Jr","dnn5"]
["Marceli","Pawlikowski","So","mzp5569"]
["Kara","Gibbon","Fr","kxg295"]
["Shannon","Cikowski","Jr","spc5519"]
["Mei Ying","Tan","Sr","mut77"]
["Chaoyi","Zhu","Jr","cxz94"]
["Qin","Zhang","Jr","qfz5029"]
["Jiasheng","Pan","Jr","jmp6546"]
["Shiva","Alladi","Sr","ssa5254"]
["Joseph","Sukunda","Sr","jhs5325"]

{"sheet":"Event21","index":9,"n_rows":23,"n_cols":4,"rows_kept":23,"cut":false,"hidden":true,"merged":[]}
["Event:","Ernst & Young"]
["Date:","2018-08-17"]
["Attendance:",18]
[]
["First Name","Last Name","Year","PSU ID (ex. abc1234)"]
["Matthew","Pidgeon","So","mpp5454"]
["Akram","Khan","Sr","ayk5511"]
["Taras","Guanowsky","Jr","txg206"]
["Marceli","Pawlikowski","So","mzp5569"]
["Brooke","Barrett","Sr","blb5681"]
["Ryan","Voyack","Sr","rjv5140"]
["Nicolette","Nybro","So","nan5101"]
["Judy","Kahn","Jr","jbk5410"]
["Joseph","Sukunda","Sr","jhs5325"]
["Rachel","Sudo","Jr","rbs5427"]
["Courtney","Cherry","Jr","clc5887"]
["Lu","Huang","Jr","lph5179"]
["Ryan","Hannon","Sr","rjh5595"]
["Duong","Nguyen","Jr","dnn5"]
["Brent","Nachiaon","Jr","bjn5158"]
["Shiva","Alladi","Sr","ssa5254"]
["Ian","Kwon","So","kxk5556"]
["Akash","Patel","So","axp428"]

{"sheet":"Event20","index":10,"n_rows":25,"n_cols":4,"rows_kept":25,"cut":false,"hidden":true,"merged":[]}
["Event:","Oliver Wyman"]
["Date:","2018-09-12"]
["Attendance:",{"$f":"COUNTA(D6:D206)","v":20}]
[]
["First Name","Last Name","Year","PSU ID (ex. abc1234)"]
["Lisa","Winters","Sr","lvw5155"]
["Mike","Callahan","Sr","mgc5166"]
["Ryan",null,"Sr","rjv5140"]
["Aaron","Gersh","Jr","arg5600"]
["Michael","Roby","Jr","msr5385"]
["Brent","Nachison","Jr","bjn5158"]
["Grace","McStravock","Jr","gvm5232"]
["Julia","Trigg","So","jxt5423"]
["Ilsa","Smith","So","ivs5154"]
["Tingting","Wu","Sr","tbw5119"]
["Matthew","Pidgeon","So","mpp5454"]
["Joseph","Sukunda","Sr","jhs5325"]
["Troy","Harro","Jr","tbh5102"]
["Judy","Kahn","Jr","jbk5410"]
["Caroline","Johnson","Jr","crj5193"]
["Rohan","Bhandarkar","Jr","rpb5416"]
["Ryan","Podufal","Sr","rwp5337"]
["Taras","Guanowsky","Jr","txg206"]
["Ryan","Hannon","Sr","rjh5595"]
["Chaoyi","Zhu","Jr","cxz94"]

{"sheet":"Event19","index":11,"n_rows":45,"n_cols":4,"rows_kept":45,"cut":false,"hidden":true,"merged":[]}
["Event:","Aetna Info Session"]
["Date:","2018-09-12"]
["Attendance:",{"$f":"COUNTA(D6:D206)","v":40}]
[]
["First Name","Last Name","Year","PSU ID (ex. abc1234)"]
["Paul","Birch","Sr","pvb5171"]
["Atharv","Gupte","Jr","abg5424"]
["Caroline","Johnson","Jr","crj5193"]
["Courtney ","Cherry","Jr","clc5887"]
["Elizabeth","Simmons","Jr","ems6139"]
["Alyssa","Lombardo","Sr","ajl5753"]
["Ashley","Morris","Sr","alm6239"]
["Krystie","Perez-Morales","So","knp5260"]
["Brooke","Barrett","Sr","blb5681"]
["Kara","Gibbon","Fr","kxg295"]
["Vince","Birch","Fr","vpb5085"]
["Justin","Strecker","Jr","jxs6288"]
["Danielle","Jameison","Sr","dkj5101"]
["Judy","Kahn","Jr","jbk5410"]
["Brent","Nachison","Jr","bjn5158"]
["Taras","Guanowsky","Jr","txg206"]
["Emily","Price","Sr","emp5391"]
["Jacob","Niedermayer","Jr","jtn5161"]
["Ryan","Pityk","So","rxp5323"]
["Akash","Patel","So","axp428"]
["Julia","Trigg","So","jxt5423"]
["Joseph","Sukunda","Sr","jhs5325"]
["Aaron ","Gersh","Jr","arg5600"]
["Aidan","Lake","So","arl5600"]
["Matthew","Pidgeon","So","mpp5454"]
["Geoffrey","Barratt","Fr","gxb92"]
["Michael","Gordon","Sr","mjg5847"]
["Yixiao","Jiang","Jr","yxj38"]
["May","Feng","Jr","muf72"]
["Grace","McStravock","Jr","gvm5232"]
["Konner","Krueger","Jr","kjk5709"]
["Tom","Piccari","Sr","tvp5216"]
["Brandon","Crawford","So","bmc5819"]
["Duong","Nguyen","Jr","dnn5"]
["Jiali","Liu","Sr","jul551"]
["Kurt","Baurle","Sr","kmb6692"]
["Ilsa","Smith","Sr","ivs5154"]
["Tingting ","Wu","Jr","tbw5119"]
["Chaoyi","Zhu","Jr","cxz94"]
["Shannon","Cikowski","Jr","spc5519"]

{"sheet":"Event18","index":12,"n_rows":36,"n_cols":4,"rows_kept":36,"cut":false,"hidden":true,"merged":[]}
["Event:","Deloitte Info Session"]
["Date:","2018-09-16"]
["Attendance:",31]
[]
["First Name","Last Name","Year","PSU ID (ex. abc1234)"]
["Matthew","Pidgeon","So","mpp5454"]
["Amanda","Shuter","So","axs6075"]
["May","Feng","Jr","muf72"]
["Aaron","Gersh","Jr","arg5600"]
["Rachel","Weber","Jr","rhw5080"]
["Troy","Harro","Jr","tbh5102"]
["Kevin","Chow","Sr","kbc5228"]
["Anu","Ogunrombi","Sr","aso5104"]
["Dante","Marcucci","So","uum99"]
["Akram","Khan","Sr","ayk5511"]
["Allison","Seibert","Jr","azs6047"]
["Alyssa","Lombardo","Sr","ajl5753"]
["Michael","Roby","Jr","msr5385"]
["Brent","Nachison","Jr","bjn5158"]
["Michael","Callahan","Sr","mgc5166"]
["Marceli","Pawlikowski","So","mzp5569"]
["Taras","Guanowsky","Jr","txg206"]
["Shannon","Cikowski","Jr","spc5519"]
["Solomon","Szeto","Fr","sms8118"]
["Siyi","Ma","Jr","sbm5554"]
["Marko","Resetar","Sr","mvr5349"]
["Beckett","Cromer","Sr","bdc5221"]
["Shiva","Alladi","Sr","ssa5254"]
["Joe","Eschx","Sr","jze5187"]
["Vera","Xia","Sr","xzx5081"]
["Yang","Gao","Jr","yug61"]
["Justin","Strecker","Jr","jxs6288"]
["Solomon","Szeto","Fr","sms8118"]
["Jiaqi","Lai","Jr","jzl38"]
["Mingzhang","Yan","Sr","mxy5097"]
["Huiyang","Ding","Sr","hvd5093"]

{"sheet":"Event17","index":13,"n_rows":22,"n_cols":4,"rows_kept":22,"cut":false,"hidden":true,"merged":[]}
["Event:","KPMG"]
["Date:","2018-09-16"]
["Attendance:",17]
[]
["First Name","Last Name","Year","PSU ID (ex. abc1234)"]
["Mingzhang","Yan","Sr","mxy5097"]
["Beckett","Cromer","Sr","bdc5221"]
["Chaoyi","Zhu","Jr","cxz94"]
["Allison ","Seibert","Jr","azs6047"]
["Nicolette","Nybro","So","nan5101"]
["Emily","Price","Sr","emp5391"]
["Joshua","Goldstein","Sr","jjg5636"]
["Taras","Guanowsky","Jr","txg206"]
["Ryan","Hannon","Sr","rjh5595"]
["Joseph","Sukunda","Sr","jhs5325"]
["Tingting","wu","Sr","tbw5119"]
["Duong","Nguyen","Jr","dnn5"]
["Elizabeth","Simmons","Jr","ems6139"]
["Judy","Kahn","Jr","jbk5410"]
["Kimberly","Anderson","Jr","ksa5170"]
["Aaron","Gersh","Jr","arg5600"]
["Shiva","Alladi","Sr","ssa5254"]

{"sheet":"Event16","index":14,"n_rows":36,"n_cols":4,"rows_kept":36,"cut":false,"hidden":true,"merged":[]}
["Event:","IBX Info Session"]
["Date:","2018-09-16"]
["Attendance:",31]
[]
["First Name","Last Name","Year","PSU ID (ex. abc1234)"]
["huiyang","ding","Sr","hvd5093"]
["Michael","Gordon","Sr","mjg5847"]
["Erica","Mills","So","ekm5337"]
["Ashley","Morris","Sr","alm6239"]
["Emily","Price","Sr","emp5391"]
["Ryan","Hazel","So","rxh378"]
["Danielle","Jameison","Sr","dkj5101"]
["May","Feng","Jr","muf72"]
["Yang","Gao","Jr","yug61"]
["Kurt","Baurle","Sr","kmb6692"]
["Joshua","Goldstein","Sr","jjg5636"]
["Margot","California","Jr","mac6866"]
["Caroline","Johnson","Jr","crj5193"]
["Rachel","Sudo","Jr","rbs5427"]
["Jiali","Liu","Sr","jul551"]
["Vince","Birch","Fr","vpb5085"]
["Beckett","Cromer","Sr","bdc5221"]
["Thomas ","Iliou","So","txi5033"]
["Zachary","Pasquinelli","Jr","zmp5056"]
["Duong","Nguyen","Jr","dnn5"]
["Julia","Trigg","So","jxt5423"]
["Ilsa","Smith","So","ivs5154"]
["Jacob","Niedermayer","Jr","jtn5161"]
["Allison","Seibert","Jr","azs6047"]
["Molly","Groarke","So","mag6298"]
["Elizabeth","Simmons","Jr","ems6139"]
["tingting","wu","Sr","tbw5119"]
["Rui","Zhao","Sr","ruz9"]
["Zihan","Zhang","Jr","zuz161"]
["Chaoyi","Zhu","Jr","cxz94"]
["Shiva","Alladi","Sr","ssa5254"]

{"sheet":"Event15","index":15,"n_rows":26,"n_cols":4,"rows_kept":26,"cut":false,"hidden":true,"merged":[]}
["Event:","Wakely"]
["Date:","2018-09-16"]
["Attendance:",21]
[]
["First Name","Last Name","Year","PSU ID (ex. abc1234)"]
["Brent","Nachison","Jr","bjn5158"]
["Michael","Roby","Jr","msr5385"]
["Qin","Zhang","Jr","qfz5029"]
["Alexis","Lasko","Jr","all5680"]
["Mallory","Beard","Jr","mmb6124"]
["Atharv ","Gupte","Jr ","abg5424"]
["Joseph","Sukunda","Sr","jhs5325"]
["Siyi","Ma","Jr","sbm5554"]
["Yiling","Chen","Jr","ypc5131"]
["Nathan","Miller","Jr","njm5536"]
["Akram","Khan","Sr","ayk5511"]
["Judy","Kahn","Jr","jbk5410"]
["Kimberly","Anderson","Jr","ksa5170"]
["Shannon","Cikowski","Jr","spc5519"]
["John","Miller","Jr","jdm6057"]
["Dante","Marcucci","So","uum99"]
["Taras","Guanowsky","Jr","txg206"]
["Ming","Chen","Sr","mwc5183"]
["Yixiao","Jiang","Jr","yxj38"]
["Tyler","Dolan","Fr","tmd5648"]
["Grace","McStravock","Jr","gvm5232"]

{"sheet":"Event14","index":16,"n_rows":78,"n_cols":4,"rows_kept":78,"cut":false,"hidden":true,"merged":[]}
["Event:","Cigna Info Session"]
["Date:","2018-09-16"]
["Attendance:",73]
[]
["First Name","Last Name","Year","PSU ID (ex. abc1234)"]
["Paul","Birch","Sr","pvb5171"]
["Jiaqi","Lai","Jr","jzl38"]
["Nathan","Miller","Jr","njm5536"]
["Harro","Troy","Jr","tbh5102"]
["Felishia","Felishia","So","ffn5018"]
["Kimberly","Anderson","Jr","ksa5170"]
["Sean","Klavans","Jr","sak5707"]
["Marceli","Pawlikowski","So","mzp5569"]
["Yixiao","Jiang","Jr","yxj38"]
["Brent","Nachison","Jr","bjn5158"]
["Kurt","Baurle","Sr","kmb6692"]
["Kelly","Waters","So","kfw5153"]
["Danielle","Jameison","Sr","dkj5101"]
["Zijing ","Cui","Sr","zjc5108"]
["Yang","Gao","Jr","yug61"]
["Tyler","Dolan","Fr","tmd5648"]
["Zachary","Pasquinelli","Jr","zmp5056"]
["Lu","Huang","Jr","lph5179"]
["Ming","Chen","Sr","mwc5183"]
["Kevin","Suryanto","Jr","kas7146"]
["Allison","Seibert","Jr","azs6047"]
["Akram","Khan","Sr","ayk5511"]
["Grace","McStravock","Jr","gvm5232"]
["Zhengyan","Yuan","Jr","zqy5133"]
["Aidan","Lake","So","arl5600"]
["Matthew","Pidgeon","So","mpp5454"]
["Alexa","Tannenbaum","Fr","aqt5407"]
["Michael","Gordon","Sr","mjg5847"]
["Zihan","Zhang","Jr","zuz161"]
["Mingzhang","Yan","Sr","mxy5097"]
["Qin ","Zhang","Jr","qfz5029"]
["Elysia","Liu","Jr","yxl482"]
["Dante","Marcucci","So","uum99"]
["Morgan","Wetzel","Sr","maw5942"]
["Weilun","Zhang","Sr","wbz5017"]
["Mallory","Beard","Jr","mmb6124"]
["Alexis","Lasko","Jr","all5680"]
["Courtney","Cherry","Jr","clc5887"]
["matthew","cash","So","mdc5571"]
["Akash","Patel","So","axp428"]
["Shannon","Cikowski","Jr","spc5519"]
["Judy","Kahn","Jr","jbk5410"]
["Yuxin","Chen","So","ymc5216"]
["Taras","Guanowsky","Jr","txg206"]
["Jiali","Liu","Sr","jul551"]
["Beckett","Cromer","Sr","bdc5221"]
["Atharv","Gupte","Jr","abg5424"]
["Ashley","Morris","Sr","alm6239"]
["Henry","Ning","Sr","hon101"]
["Frankie","Haver","Jr","fph5023"]
["Caroline","Johnson","Jr","crj5193"]
["May","Feng","Jr","muf72"]
["Alexis","Coleman","So","akc5641"]
["Brandon","Crawford","So","bmc5819"]
["Julia","Trigg","So","jxt5423"]
["Collin","O'Connell","So","cpo5122"]
["Aaron","Gersh","Jr","arg5600"]
["Joseph","Sukunda","Sr","jhs5325"]
["John","Miller","Jr","jdm6057"]
["Jacob","Niedermayer","Jr","jtn5161"]
["Nicolette","Nybro","So","nan5101"]
["Avery","Ryan","So","aer5483"]
["Rohan","Bhandarkar","Jr","rpb5416"]
["margot","California","Jr","mac6866"]
["Siyi","Ma","Jr","sbm5554"]
["Ethan","Frederick","Sr","esf5093"]
["Noah","Blake","Sr","nrb5272"]
["Huiyang","Ding","Sr","hvd5093"]
["Elizabeth","Simmons","Jr","ems6139"]
["Duong","Nguyen","Jr","dnn5"]
["Justin","Strecker","Jr","jxs6288"]
["Alyssa","Lombardo","Sr","ajl5753"]
["tingting","wu","Sr","tbw5119"]

{"sheet":"Event13","index":17,"n_rows":57,"n_cols":4,"rows_kept":57,"cut":false,"hidden":true,"merged":[]}
["Event:","Prudential "]
["Date:","2018-09-16"]
["Attendance:",{"$f":"COUNTA(B6:B57)","v":52}]
[]
["First Name","Last Name","Year","PSU ID (ex. abc1234)"]
["Kyle","Mauger","So","kjm6235"]
["Cristina","Peloro","Fr","czp5434"]
["Rachel","Weber","Jr","rhw5080"]
["Bradley","Shafer","So","bxs437"]
["Joe","Esch","Sr","jze5187"]
["Shreya","Bibra","Fr","svb6003"]
["Brooke","Barrett","Sr","blb5681"]
["Morgan","Wetzel","Sr","maw5942"]
["Taras","Guanowsky","Jr","txg206"]
["Nathan","Miller","Jr","njm5536"]
["John","Miller","Jr","jdm6057"]
["Caroline","Johnson","Jr","crj5193"]
["Ashley","Morris ","Sr","alm6239"]
["Judy","Kahn","Jr","jbk5410"]
["Zachary","Pasquinelli","Jr","zmp5056"]
["Kimberly","Anderson","Jr","ksa5170"]
["Courtney","Cherry","Jr","clc5887"]
["Brent","Nachison","Jr","bjn5158"]
["Kelly","Waters","So","kfw5153"]
["Dante","Marcucci","So","uum99"]
["Collin","O'Connell","So","cpo5122"]
["Troy","Harro","Jr","tbh5102"]
["Rachel","Sudo","Jr","rbs5427"]
["Henry","Ning","Sr","hon101"]
["Jiali","Liu","Sr","jul551"]
["Beckett","Cromer","Sr","bdc5221"]
["Eliizabeth","Simmons","Jr","ems6139"]
["Duong","Nguyen","Jr","dnn5"]
["Aidan","Lake","So","arl5600"]
["Alyssa","Lombardo","Sr","ajl5753"]
["Allison","Seibert","Jr","azs6047"]
["Yang","Gao","Jr","yug61"]
["May","Feng","Jr","muf72"]
["Shannon","Cikowski","Jr","spc5519"]
["Alexa","Tannenbaum","Fr","aqt5407"]
["Rohan","Bhandarkar","Jr","rpb5416"]
["Nicolette","Nybro","So","nan5101"]
["Avery","Ryan","So","aer5483"]
["Jake","Wiley","Jr","jrw5844"]
["Marceli","Pawlikowski","So","mzp5569"]
["Sunrunyi","Yuan","So","spy5117"]
["Aaron","Gersh","Jr","arg5600"]
["tingting","wu","Sr","tbw5119"]
["Matthew","Pidgeon","So","mpp5454"]
["Yixiao","Jiang","Jr","yxj38"]
["Rui","Zhao","Sr","ruz9"]
["Margot","Californnia","Jr","mac6866"]
["Atharv","Gupte","Jr","abg5424"]
["Chaoyi","Zhu","Jr","cxz94"]
["Solomon","Szet","Fr","sms8118"]
["Huiyang","Ding","Sr","hvd5093"]
["Kevin ","Chow","Sr","kbc5228"]

{"sheet":"Event12","index":18,"n_rows":54,"n_cols":4,"rows_kept":54,"cut":false,"hidden":true,"merged":[]}
["Event:","Highmark Health"]
["Date:","2018-09-16"]
["Attendance:",49]
[]
["First Name","Last Name","Year","PSU ID (ex. abc1234)"]
["Jeremy","Williams","Jr","jsw5439"]
["Marko","Resetar","Sr","mvr5349"]
["Patrick","Voss","Fr","puv44"]
["Raymond","Lu","So","lmr5640"]
["Jonathan","Mumford","So","jbm5733"]
["Kurt","Baurle","Sr","kmb6692"]
["Kari","Huth","Sr","kvh5221"]
["Amanda","Shuter","Sr","axs6075"]
["Frankie","Haver","Jr","fph5023"]
["Carmen","Veltri","Fr","cpv5095"]
["Ming","Chen","Sr","mwc5183"]
["Lucas","Richardsen","Fr","ljr5433"]
["Morgan","Wetzel","Sr","maw5942"]
["Courtney","Cherry","Jr","clc5887"]
["Jake","Wiley","Jr","jrw5844"]
["Kai-Uwe","Konrad","So","kwk5449"]
["Taras","Guanowsky","Jr","txg206"]
["John","Miller","Jr","jdm6057"]
["Jiali","Liu","Sr","jul551"]
["Tingting","Wu","Sr","tbw5119"]
["Alyssa","Lombardo","Sr","ajl5753"]
["Myles","Cramer","Fr","mfc5610"]
["Troy","Harro","Jr","tbh5102"]
["Allison","Seibert","Jr","azs6047"]
["Kelly","Waters","So","kfw5153"]
["Atharv","Gupte","Jr","abg5424"]
["May","Feng","Jr","muf72"]
["Brandon","Crawford","So","bmc5819"]
["Nathan","Miller","Jr","njm5536"]
["Shannon","Cikowski","Jr","spc5519"]
["Nicolette","Nybro","So","nan5101"]
["Avery","Ryan","So","aer5483"]
["Collin","O'Connell","So","cpo5122"]
["Ashley","Morris","Sr","alm6239"]
["Beckett","Cromer","Sr","bdc5221"]
["Joe","Esch","Sr","jze5187"]
["Rohan","Bhandarkar","Jr","rpb5416"]
["Zachary","Pasquinelli","Jr","zmp5056"]
["Yang","Gao","Jr","yug61"]
["Brent","Nachison","Jr","bjn5158"]
["Mike","Roby","Jr","msr5385"]
["Akram","Khan","Sr","ayk5511"]
["Dante","Marcucci","So","uum99"]
["Chaoyi","Zhu","Jr","cxz94"]
["Rachel","Sudo","Jr","rbs5427"]
["Huiyang","Ding","Sr","hvd5093"]
["Brooke","Barrett","Sr","blb5681"]
["Shiva","Alladi","Sr","ssa5254"]
["Vera","Xia","Sr","xzx5081"]

{"sheet":"Event11","index":19,"n_rows":56,"n_cols":4,"rows_kept":56,"cut":false,"hidden":true,"merged":[]}
["Event:","WTW"]
["Date:","2018-09-16"]
["Attendance:",51]
[]
["First Name","Last Name","Year","PSU ID (ex. abc1234)"]
["Erica","Mills","So","ekm5337"]
["Qin","Zhang","Jr","qfz5029"]
["Siyi","Ma","Jr","sbm5554"]
["Chaoyi","Zhu","Jr","cxz94"]
["Ryan","Hazel","So","rxh378"]
["tingting","wu","Sr","tbw5119"]
["Alexis","Lasko","Jr","all5680"]
["Solomon","Szeto","Fr","sms8118"]
["Rachel","Sudo","Jr","rbs5427"]
["Emily","Price","Sr","emp5391"]
["Yuxin","Chen","So","ymc5216"]
["Ming","Chen","Sr","mwc5183"]
["Danielle","Jameison","Sr","dkj5101"]
["Atharv","Gupte","Jr","abg5424"]
["Joshua","Goldstein","Sr","jjg5636"]
["Yiling","Chen","Jr","ypc5131"]
["Caroline","Johnson","Jr","crj5193"]
["Judy","Kahn","Jr","jbk5410"]
["Taras","Guanowsky","Jr","txg206"]
["Zijing","Cui","Sr","zjc5108"]
["Zachary","Pasquinelli","Jr","zmp5056"]
["Kevin","Suryanto","Jr","kas7146"]
["Vince","Birch","Fr","vpb5085"]
["Felishia","Felishia","So","ffn5018"]
["Akram","Khan","Sr","ayk5511"]
["Jiali","Liu","Sr","jul551"]
["Aaron","Gersh","Jr","arg5600"]
["Tianheng","Huang","Sr","txh5267"]
["Zihan ","zhang","Jr","zuz161"]
["Dante","Marcucci","So","uum99"]
["Beckett","Cromer","Sr","bdc5221"]
["Tyler","Dolan","Fr","tmd5648"]
["yu","luo","Jr","yml5242"]
["Allison","Seibert","Jr","azs6047"]
["Julia","Trigg","So","jxt5423"]
["Molly ","Groarke","So","mag6298"]
["Ilsa","Smith","So","ivs5154"]
["May","Feng","Jr","muf72"]
["Yang","Gao","Jr","yug61"]
["Elizabeth","Simmons","Jr","ems6139"]
["Duong","Nguyen","Jr","dnn5"]
["jacob","niedermayer","Jr","jtn5161"]
["Weilun","Zhang","Sr","wbz5017"]
["Jiasheng","Pan","Jr","jmp6546"]
["Marceli","Pawlikowski","So","mzp5569"]
["Jiaqi","Lai","Jr","jzl38"]
["Mingzhang","Yan","Sr","mxy5097"]
["Lu","Huang","Jr","lph5179"]
["Vera","Xia","Sr","xzx5081"]
["Elysia","Liu","Jr","yxl482"]
["Huiyang","Ding","Sr","hvd5093"]

{"sheet":"Event10","index":20,"n_rows":22,"n_cols":4,"rows_kept":22,"cut":false,"hidden":true,"merged":[]}
["Event:","GAFG Info Session"]
["Date:","2018-09-11"]
["Attendance:",{"$f":"COUNTA(D6:D206)","v":17}]
[]
["First Name","Last Name","Year","PSU ID (ex. abc1234)"]
["Mingzhang","Yan","Sr","mxy5097"]
["Joseph","Sukunda","Sr","jhs5325"]
["Chaoyi","Zhu","Jr","cxz94"]
["Julia","Trgg","So","jxt5423"]
["Joshua","Goldstein","Sr","jjg5636"]
["Jacob","Niedermayer","JR","jtn5161"]
["Ryan","Podufal","SR","rwp5337"]
["Lu","Huang","JR","lph5179"]
["Tyler","Dolan","Fr","tmd5648"]
["Nicolette","Nybro","So","nan5101"]
["Brent","Nachison","Jr","bjn5158"]
["Michael","Roby","Jr","msr5385"]
["Haozheng","Chen","So","hjc5263"]
["Siyi","Ma","Jr","sbm5554"]
["Jiasheng","Pan","Jr","jmp6546"]
["Elysia ","Liu","Jr","yxl482"]
["Christina","Peloro","FR","czp5434"]

{"sheet":"Event9","index":21,"n_rows":15,"n_cols":4,"rows_kept":15,"cut":false,"hidden":true,"merged":[]}
["Event:","Lunch with Leaders"]
["Date:","2018-09-07"]
["Attendance:",{"$f":"COUNTA(D6:D206)","v":10}]
[]
["First Name","Last Name","Year","PSU ID (ex. abc1234)"]
["Cristina","Peloro","Fr","czp5434"]
["Yousef","Jubran","Sr","ynj5007"]
["Thomas","Iliou","So","txi5033"]
["Chris","Scalies","Fr","cjs6819"]
["Tsz Yau Iris","Chow","Fr","tfc5229"]
["Beckett","Cromer","Sr","bdc5221"]
["Akash","Patel","So","axp428"]
["Jiaqi ","Lai","Jr","jzl38"]
["Andrew","Modzelewski","Jr","gam5292"]
["Rafael","Bergerman","Sr","rmb5769"]

{"sheet":"Event8","index":22,"n_rows":29,"n_cols":4,"rows_kept":29,"cut":false,"hidden":true,"merged":[]}
["Event:","International Student Meeting"]
["Date:","2018-09-05"]
["Attendance:",{"$f":"COUNTA(D6:D206)","v":24}]
[]
["First Name","Last Name","Year","PSU ID (ex. abc1234)"]
["Paul","Birch","Sr","pvb5171"]
["Vera","Xia","Sr","xzx5081"]
["Yuxin","Chen","So","ymc5216"]
["Jiasheng","Pan","Jr","jmp6546"]
["Kabir","Kohli","Jr","kxk338"]
["Kevin","Suryanto","Jr","kas7146"]
["Felishia","Felishia","So","ffn5018"]
["Eric","Zi","Fr","gzz5074"]
["Anu","Ogunrombi","Sr","aso5104"]
["Jiaqi","Lai","Jr","jzl38"]
["Haozheng","Chen","So","hjc5263"]
["Qiaojuan","Tu","Fr","qkt5010"]
["Elysia","Liu","Jr","yxl482"]
["YIDING","WANG","Jr","yzw164"]
["Yanan","Sun","Jr","yzs70"]
["Bingxin","Liu","Fr","bzl95"]
["Sunrunyi","Yuan","So","spy5117"]
["Mingyin","Xie","So","mvx5050"]
["Hanlin","Zhang","Fr","hbz5102"]
["Mingzhang","Yan","Jr","mxy5097"]
["Chaoyi","Zhu","Jr","cxz94"]
["Hsobo","Fan","Fr","hmf5251"]
["Siyi","Ma","Jr","sbm5554"]
["Ruxin","Tong","Jr","rxt26"]

{"sheet":"Event7","index":23,"n_rows":33,"n_cols":4,"rows_kept":33,"cut":false,"hidden":true,"merged":[]}
["Event:","R Session 2"]
["Date:","2018-09-04"]
["Attendance:",28]
[]
["First Name","Last Name","Year","PSU ID (ex. abc1234)"]
["Brent","Nachison","Jr","bjn5158"]
["Connor","Grabowski","Jr","ctg5142"]
["Kelly","Waters","So","kfw5153"]
["Jiali","Liu","Sr","jul551"]
["Vince","Melchiorre","Fr","vzm35"]
["Mike","Deo","Fr","mqd5586"]
["Beckett","Cromer","Sr","bdc5221"]
["Daniel","Marinelli","Fr","dbm5481"]
["Tamesha","Harris","Jr","tqh5336"]
["Jennifer","Davis","So","jrd5822"]
["Noah","Donten","So","nmd5348"]
["Kai","Konrad","Fr","kwk5449"]
["Aidan","Lake","So","arl5600"]
["Zihan","Zhang","Jr","zuz161"]
["Myles","Cramer","Fr","mfc5610"]
["Collin","O'Connell","So","cpo5122"]
["Troy","Harro","Jr","tbh5102"]
["Tsz Yau Iris","Chow","Fr","tfc5229"]
["Peter","DeMallie","So","prd5123"]
["Shreya","Bibra","Fr","svb6003"]
["Jacob","Niedermayer","Jr","jtn5161"]
["Yixiao","Jiang","Jr","yxj38"]
["Duong","Nguyen","Jr","dnn5"]
["Judy","Kahn","Jr","jbk5410"]
["Margot","California","Jr","mac6866"]
["Olivia","Dalby","Jr","opd5013"]
["Nathan","Putt","Jr.","nrp5173"]
["Nicolette","Nybro","So","nan5101"]

{"sheet":"Event6","index":24,"n_rows":47,"n_cols":4,"rows_kept":47,"cut":false,"hidden":true,"merged":[]}
["Event:","Resume Review"]
["Date:","2018-08-30"]
["Attendance:",{"$f":"COUNTA(D6:D206)","v":42}]
[]
["First Name","Last Name","Year","PSU ID (ex. abc1234)"]
["Liam","Richards","Sr","lrr5177"]
["Andrew","Modzelewski","Jr","gam5292"]
["Beckett","Cromer","Sr","bdc5221"]
["Lu","Huang","Jr","lph5179"]
["Yixiao","Jiang","Jr","yxj38"]
["Alex","Arena","Jr","afa5399"]
["Alexis","Coleman","So","akc5641"]
["Rohan","Bhandarkar","Jr","rpb5416"]
["Nathan","Paisley","Fr","nmp5392"]
["Margot","California","Jr","mac6866"]
["Jacob","Niedermayer","Jr","jtn5161"]
["Iris","Chow","Fr","tfc5229"]
["Jiaqi","Lai","Jr","Jzl38"]
["Sabrina","Garcia","Sr","sqg5499"]
["Jiasheng","Pan","Jr","jmp6546"]
["Yanan","Sun","Jr","yzs70"]
["Michael","Roby","Jr","msr5385"]
["Rachel","Sudo","Jr","rbs5427"]
["Brooke ","Barrett","Sr","blb5681"]
["Matthew","Pidgeon","So","mpp5454"]
["Taras","Guanowsky","Jr","txg206"]
["Allison","Seibert","Jr","azs6047"]
["Julia","Trigg","So","jxt5423"]
["Alyssa","Lombardo","Sr","ajl5753"]
["Anu","Ogunrombi","Sr","aso5104"]
["Kyle","Mauger","So","kjm6235"]
["Raymond","Lu","So","lmr5640"]
["Dante","Marcucci","So","uum99"]
["Joshua ","Williams","Jr","jkw5499"]
["Jordan","Reiter","Jr","jar6334"]
["Shannon","Cikowski","Jr","spc5519"]
["Ruixin","Han","So","rvh5387"]
["Matthew","Cash","So","mdc5571"]
["Aidan","Lake","So","arl5600"]
["Paul","Birch","Sr","pvb5171"]
["Grace","McStravock","Jr","gvm5232"]
["Joe","Sukunda","Sr","jhs5235"]
["Shiva","Alladi","Sr","ssa5254"]
["John","Miller","Jr","jdm6057"]
["Brent","Nachison","Jr","bjn5158"]
["Vera","Xia","Sr","xzx5081"]
["Akash","Patel","So","axp428"]

{"sheet":"Event5","index":25,"n_rows":15,"n_cols":4,"rows_kept":15,"cut":false,"hidden":true,"merged":[]}
["Event:","Commonwealth Student Meeting"]
["Date:","2018-08-29"]
["Attendance:",{"$f":"COUNTA(D6:D206)","v":10}]
[]
["First Name","Last Name","Year","PSU ID (ex. abc1234)"]
["Paul","Birch","Sr","pvb5171"]
["Konner","Krueger","Jr","kjk5709"]
["Kelly","Waters","Jr","kfw5153"]
["Jingzhe","Han","Jr","jjh6271"]
["YIDIND","WANG","Jr","yzw164"]
["Zhiyi ","Han","Jr","zvh5145"]
["Yanan","Sun","Jr","yzs70"]
["Elizabeth","Simmons","Jr","ems6139"]
["Chaoyi","Zhu","Jr","cxz94"]
["Ruxin","Tong","Jr","rxt26"]

{"sheet":"Event4","index":26,"n_rows":20,"n_cols":4,"rows_kept":20,"cut":false,"hidden":true,"merged":[]}
["Event:","Geico Info Session"]
["Date:","2018-08-29"]
["Attendance:",{"$f":"COUNTA(D6:D206)","v":15}]
[]
["First Name","Last Name","Year","PSU ID (ex. abc1234)"]
["Brent","Nachison","Jr","bjn5158"]
["Connor","Grabowski","Jr","ctg5142"]
["Alyssa","Lombardo","Sr","ajl5753"]
["Alexandra","Stiles","Sr","als6468"]
["Joseph","Sukunda","Sr","jhs5325"]
["Joshua","Goldstein","Sr","jjg5636"]
["Taras","Guanowsky","Jr","txg206"]
["Juliette","van Schaik","Jr","jiv5171"]
["Jacob","Niedermayer","Jr","jtn5161"]
["Beckett","Cromer","Sr","bdc5221"]
["Matthew","Pidgeon","So","mpp5454"]
["Vince","Birch","Fr","vpb5085"]
["Evan","Rerecich","Sr","emr5498"]
["Elysia","Liu","Jr","yxl482"]
["Simiao","Dong","Fr","sqd5576"]

{"sheet":"Event3","index":27,"n_rows":35,"n_cols":4,"rows_kept":35,"cut":false,"hidden":true,"merged":[]}
["Event: ","R Session 1"]
["Date:","2018-08-28"]
["Attendance:",{"$f":"COUNTA(D6:D206)","v":30}]
[]
["First Name","Last Name","Year","PSU ID (ex. abc1234)"]
["Brent","Nachison","Jr","bjn5158"]
["Nathan","Putt","Jr","nrp5173"]
["Rachel","Weber","Jr","rhw5080"]
["Connor","Grabowski","Jr","ctg5142"]
["Krystie","Perez","So","knp5260"]
["Jennifer","Davis","So","jrd5822"]
["Aidan","Lake","So","arl5600"]
["Greg","Westfall","Fr","gvw5064"]
["Vince","Melchiorre","Fr","vzm35"]
["Noah","Donten","So","nmd5348"]
["Alex","Arena","Jr","afa5399"]
["Jacob","Rausch","Fr","jmr6884"]
["Alex","Hartman","So","auh363"]
["Peter","DeMallie","So","prd5123"]
["Jeremy","Pritts","Jr","jrp5836"]
["Beckett","Cromer","Sr","bdc5221"]
["Shreya","Bibra","Fr","svb6003"]
["Collin","O'Connell","So","cpo5122"]
["yiding","wang","Jr","yzw164"]
["Zhiyi","Han","Jr","zvh5145"]
["Yixiao","Jiang","Jr","yxj38"]
["Xiaohan","Cai","Jr","xzc5175"]
["jacob","Niedermayer","Jr","jtn5161"]
["Nicolette","Nybro","So","nan5101"]
["Myles","Cramer","Fr","mfc5610"]
["Nathan","Newman","So","ngn5017"]
["Lucas","Richardsen","Fr","ljr5433"]
["Ziling","zhang","Jr","zmz5078"]
["Iris","Chow","Fr","tfc5229"]
["Duong","Nguyen","Jr","dnn5"]

{"sheet":"Event2","index":28,"n_rows":80,"n_cols":4,"rows_kept":80,"cut":false,"hidden":true,"merged":[]}
["Event:","Resume/Interview Workshop"]
["Date:","2018-08-27"]
["Attendance:",{"$f":"COUNTA(D6:D206)","v":75}]
[]
["First Name","Last Name","Year","PSU ID (ex. abc1234)"]
["Paul","Birch","Sr","pvb5171"]
["Mitch","Detwiler","So","mxd5561"]
["Taylor ","Geppert ","Fr","stg5184"]
["David","Wooditch","Jr","dmw5806"]
["Lucas","Richardsen","Fr","ljr5433"]
["Jordan","Reiter","Jr","jar6334"]
["Collin","O'Connell","So","cpo5122"]
["Morgan","Wetzel","Sr","maw5942"]
["Alexis","Coleman","So","akc5641"]
["Kara","Gibbon","Fr","kxg295"]
["Vince","Birch","Fr","vpb5085"]
["Peter","DeMallie","So","prd5123"]
["Maria","Howe","Fr","mrh64"]
["Caroline","Johnson","Jr","crj5193"]
["Jiaqi ","Lai","Jr","jzl38"]
["Andrew","Modzelewski","Jr","gam5292"]
["Sean","Klavans","Jr","sak5707"]
["Longhao","Yang","So","lky5069"]
["Ruixin ","Han","So","rvh5387"]
["Sabrina","Garcia","Sr","sqg5499"]
["Patrick","Voss","Fr","puv44"]
["May","Feng","Jr","muf72"]
["Yixiao","Jiang","Jr","yxj38"]
["Danielle","Jameison","Sr","dkj5101"]
["Matthew","Cash","So","mdc5571"]
["Zhiyang","Liang","Fr","zfl5166"]
["Carmen","Veltri","Fr","cpv5095"]
["Jake","Wagner","Fr","jfw5541"]
["Mei Ying ","Tan","Sr","mut77"]
["Felishia",null,"Sr","ffn5018"]
["Jeremy","Williams","Jr","jsw5439"]
["Alex","Hartman","So","auh363"]
["Michael","Roby","Jr","msr5385"]
["Emily","Price","Sr","emp5391"]
["Maya","DiGirolamo","Fr","mvd5783"]
["Claudia","Jung","Jr","cjj5206"]
["Chaoyi","Zhu","Jr","cxz94"]
["Alyssa","Lombardo","Sr","ajl5753"]
["Ryan","Hazel","So","rxh378"]
["Will ","Stephens ","Fr","whs5100"]
["Jon","Mumford","So","jbm5733"]
["Kurt","Baurle","Sr","kmb6692"]
["Frankie","Haver","Jr","fph5023"]
["Matthew","Pidgeon","So","mpp5454"]
["Iris ","Chow","So","tfc5229"]
["Kevin","Suryanto","Jr","kas7146"]
["Elysia","Liu","Jr","yxl482"]
["Vince ","Melchiorre","Fr","vzm35"]
["Justin","Strecker","Jr","jxs6288"]
["Brandon","Crawford","So","bmc5819"]
["Greg","Westfall","Fr","gvw5064"]
["Beckett","Cromer","Sr","bdc5221"]
["Julia","Trigg","So","jxt5423"]
["Colby","Aument","Fr","cga5095"]
["Alexa","Tannenbaum","Fr","aqt5407"]
["Konner","Krueger","Fr","kjk5709"]
["Yuxin ","Chen","Fr","ymc5216"]
["Jaccob","Rausch","Fr","jmr6884"]
["Erica","Mills","So","ekm5337"]
["Kody","Allen","Jr","kla5319"]
["Kelly","Waters","So","kfw5153"]
["Jacob","Niedermayer","Jr","jtn5161"]
["Nicolette","Nybro","So","nan5101"]
["Kevin","Logan","So","ktl5134"]
["Alex","Arena","Jr","afa5399"]
["Nathan","Newman","So","ngn5017"]
["Alexandra","Stiles","Sr","als6468"]
["Raymond","Lu","So","lmr5640"]
["Kyle","Mauger","So","kjm6235"]
["Matt","McClintick","Fr ","mjm7869"]
["Sunrunyi","Yuan","So","spy5117"]
["Troy","Harro","Jr","tbh5102"]
["Ryan ","Voyack","Sr","rjv5140"]
["Lisa","Winters","Sr","lvw5155"]
["Ethan","Frederick","Sr","esf5093"]

{"sheet":"Event1","index":29,"n_rows":118,"n_cols":4,"rows_kept":118,"cut":false,"hidden":true,"merged":[]}
["Event: ","Major Forum"]
["Date:","2018-08-23"]
["Attendance:",{"$f":"COUNTA(D6:D206)","v":113}]
[]
["First","Last","Year","ID"]
["Joseph","Sukunda","Sr","jhs5325"]
["Katherine","Horan","Fr","kjh5927"]
["Chaoyi","Zhu","Jr","cxz94"]
["David","Wooditch","Jr","dmw5806"]
["Nick","Dingman","Fr","nvd5236"]
["Kara","Gibbon","Fr","kxg295"]
["Anna","Leon","Fr","ajl6225"]
["Holly","Linkoski","Sr","hal5157"]
["Paige","Hughes","So","plh5156"]
["O'Connell","Collin","So","cpo5122"]
["Michael","Torbert","Fr","mat5816"]
["Greg","Westfall","Fr","gvw5064"]
["Alexa","Tannenbaum","Fr","aqt5407"]
["Julia","Semmer","Fr","jvs6630"]
["joseph","roantree","So","jzr98"]
["Colby","Aument","Fr","cga5095"]
["erin","wicker","Fr","euw60"]
["Ian","Kwon","So","kxk5556"]
["Konner","Krueger","Jr","kjk5709"]
["Brooke","Barrett","Sr","blb5681"]
["Jennifer","Davis","So","jrd5822"]
["Joseph","Kaverman","So","jmk6605"]
["Jacob","Niedermayer","Jr","jtn5161"]
["Sawyer","Parks","Fr","sjp5946"]
["Yuxin","Chen","So","ymc5216"]
["Krystie","Perez-Morales","So","knp5260"]
["Katie","Ridenour","Fr","kmr70"]
["Vince","Melchiorre","Fr","vzm35"]
["Morgan","Wetzel","Sr","maw5942"]
["Kelly","Waters","So","kfw5153"]
["Thomas","Piccari","Sr","tvp5216"]
["Benjamin","Koch","Fr","buk99"]
["Ryan","Pityk","So","rxp5323"]
["matthew","cash","So","mdc5571"]
["Konrad","Kai","Fr","Kwk5449"]
["Patrick","Voss","Fr","puv44"]
["Alex","Hartman","So","auh363"]
["Erica","Mills","So","ekm5337"]
["Ryan","Hazel","So","rxh378"]
["Kevin","Westfall","Fr","kpw5279"]
["Tyler","Dolan","Fr","tmd5648"]
["Jeremy","Williams","Jr","jsw5439"]
["Maria","Howe","Fr","mrh64"]
["Felishia",null,"So","ffn5018"]
["Julia","Trigg","So","jxt5423"]
["Ilsa","Smith","So","ivs5154"]
["Nikolas","Steacker","Fr","nps5409"]
["Paige","Glover","Fr","pag5319"]
["Zhiyang","Liang","Fr","zfl5166"]
["Peter","DeMallie","So","prd5123"]
["Taylor","Geppert","Fr","stg5184"]
["Myles","Cramer","Fr","mfc5610"]
["Chris","Scalies","Fr","cjs6819"]
["Jiasheng","Pan","Jr","jmp6546"]
["Yanan","Sun","Jr","yzs70"]
["Kari","Huth","Sr","kvh5221"]
["David","Bromberg","So","dmb6403"]
["siamio","dong","Fr","sqd5576"]
["Jake","Wagner","Fr","jfw5541"]
["Rohan","Bhandarkar ","Jr","rpb5416"]
["Sunrunyi","Yuan","So ","spy5117"]
["Ashley","Kniff","Fr","ank5452"]
["Remington","Harris","Fr","rgh5122"]
["Mingyin","Xie","So","mvx5050"]
["Longhao","Yang","So","lky5069"]
["Lucas","Richardsen","Fr","ljr5433"]
["Mitch","Detwiler","So","mxd5561"]
["Drew","Insley","Fr","dki5019"]
["Solomon","Szeto","Fr","sms8118"]
["Brian","Garbacik","Fr","brg16"]
["Jiaqi","Lai","Jr","jzl38"]
["Carmen","Veltri","Fr","cpv5095"]
["Hanlin","Zhang","Fr","hbz5102"]
["Haobo","Fan","Fr","hmf5251"]
["Aidan","Lake","So","arl5600"]
["Kabir ","Kohli","Jr","kxk338"]
["Matt ","McClintick","Fr","mjm7869"]
["Nicolette","Nybro","So","nan5101"]
["Alexis","Coleman","So","akc5641"]
["Maya","DiGirolamo","Fr","mvd5783"]
["Kyle","Mauger","So","kjm6235"]
["Eric ","Zi","Fr","gzz5074"]
["Kevin","Suryanto","Jr","kas7146"]
["Ethan","Cai","Fr","wvc5264"]
["Geoffrey","Barratt","Fr","gxb92"]
["Qiaojuan","Tu","Fr ","qkt5010"]
["chunxu","wang","Fr","ckw5354"]
["Matt","Pidgeon","So","mpp5454"]
["Raymond","Lu","So","lmr5640"]
["Dante","Marcucci","Fr","uum99"]
["Kevin","Chow","Sr ","kbc5228"]
["Paul","Birch","Sr","pvb5171"]
["Nick ","Mirandi","Fr","nxm5386"]
["Bradley","Shafer","So","bxs437"]
["Daniel","Marinelli","Fr","dbm5481"]
["Beckett","Cromer","Sr","bdc5221"]
["Nathan","Newman","So","ngn5017"]
["Nathan","Paisley","Fr","nmp5392"]
["Kevin","Logan","So","ktl5134"]
["YIDING","WANG","Jr","yzw164"]
["Zhaoxin","Liang","Jr","zxl5305"]
["Vince","Birch","Fr","vpb5085"]
["Danielle","Jameison","Sr","dkj5101"]
["Blake","Rohrbacher","Jr","bkr5178"]
["justin","Strecker","Jr","jxs6288"]
["Kody","Allen","Jr","kla5319"]
["Bokai","Chen","So","bxc59"]
["Anu","Ogunrombi","Sr","aso5104"]
["Shiva","Alladi","Sr","ssa5254"]
["Brent","Nachison","Jr","bjn5158"]
["Vera","Xia","Sr","xzx5081"]
["Akash","Patel","So","axp428"]
["Ethan","Frederick","Sr","esf5093"]

{"sheet":"Major Forum Roster","index":30,"n_rows":114,"n_cols":7,"rows_kept":114,"cut":false,"hidden":true,"merged":[]}
["8/23/2018 Act. Sci. Major Forum Sign-In"]
[]
["First","Last","PSU ID","Year","Paid Dues?","Phone Number (to be added in GroupMe)"]
["Joseph","Sukunda","jhs5325","Senior","No"]
["Katherine","Horan","kjh5927","Freshman","No"]
["Chaoyi","Zhu","cxz94","Junior","No"]
["David","Wooditch","dmw5806","Junior","No","(717) 378-1101"]
["Nick","Dingman","nvd5236","freshman","no",3154093849]
["Kara","Gibbon","kxg295","freshman","No","724-549-7466"]
["Anna","Leon","ajl6225","freshman","no",2673721364]
["Holly","Linkoski","hal5157","senior","yes"]
["Paige","Hughes","plh5156","sophmore","yes",8622483439]
["O'Connell","Collin","cpo5122","sophmore","yes",4843749140]
["Michael","Torbert","mat5816","Freshman","no",7175425394]
["Greg","Westfall","gvw5064","freshman","yes",8142171436]
["Alexa","Tannenbaum","aqt5407","Freshman","yes",2155004111]
["Julia","Semmer","jvs6630","Freshman","no",6103249787]
["joseph","roantree","jzr98","sophmore","yes",8566894489]
["Colby","Aument","cga5095","freshman","yes",7173710979]
["erin","wicker","euw60","freshman","no",6099752134]
["Ian","Kwon","kxk5556","sophmore","no"]
["Konner","Krueger","kjk5709","junior","yes",9103919331]
["Brooke","Barrett","blb5681","senior","no",7179770962]
["Jennifer","Davis","jrd5822","sophmore","yes",2152790972]
["Joseph","Kaverman","jmk6605","sophomore","no",8146022341]
["Jacob","Niedermayer","jtn5161","junior","yes",8562960601]
["Sawyer","Parks","sjp5946","freshman","no",7243326609]
["Yuxin","Chen","ymc5216","sophmore","no"]
["Krystie","Perez-Morales","knp5260","Sophmore","yes","917-974-8268"]
["Katie","Ridenour","kmr70","Freshman","no",7179619919]
["Vince","Melchiorre","vzm35","Freshman","yes","412-932-0387"]
["Morgan","Wetzel","maw5942","Senior","yes","412-926-9999"]
["Kelly","Waters","kfw5153","Sophomore","yes",4843540703]
["Thomas","Piccari","tvp5216","Senior","yes",6102839817]
["Benjamin","Koch","buk99","Freshman","no","440-212-8698"]
["Ryan","Pityk","rxp5323","sophmow","yes","724-766-3528"]
["matthew","cash","mdc5571","sophomore","no",7173873837]
["Konrad","Kai","Kwk5449","Freshman","yes","516-289-2129"]
["Patrick","Voss","puv44","Freshamn","Yes","412-443-9909"]
["Alex","Hartman","auh363","Sophmore","Yes","724-987-3729"]
["Erica","Mills","ekm5337","Sophmore","Yes","224-723-8186"]
["Ryan","Hazel","rxh378","Sophmore","Yes","860-990-2814"]
["Kevin","Westfall","kpw5279","freshman","Yes","412-944-6616"]
["Tyler","Dolan","tmd5648","freshman","yes",2672619076]
["Jeremy","Williams","jsw5439","junior","yes","724-884-3556"]
["Maria","Howe","mrh64","Freshman","Yes",7179470358]
["Felishia",null,"ffn5018","sophomore","no",2674957049]
["Julia","Trigg","jxt5423","sophomore","no",6103145705]
["Ilsa","Smith","ivs5154","sophmore","no",7176686452]
["Nikolas","Steacker","nps5409","freshman","yes",2155885892]
["Paige","Glover","pag5319","freshman","yes","720-355-6450"]
["Zhiyang","Liang","zfl5166","Freshman","yes",8148808256]
["Peter","DeMallie","prd5123","Sophomore","yes",2674410107]
["Taylor","Geppert","stg5184",null,"yes",4125187205]
["Myles","Cramer","mfc5610","Freshman","No",7245313960]
["Chris","Scalies","cjs6819","Freshman","yes",4845575101]
["Jiasheng","Pan","jmp6546","Junior","Yes",5715268214]
["Yanan","Sun","yzs70","Junior","Yes",7175928968]
["Kari","Huth","kvh5221","Senioer","yes",7248226737]
["David","Bromberg","dmb6403","Sophomore","no",7866615651]
["siamio","dong","sqd5576","freshman","no",8146991933]
["Jake","Wagner","jfw5541","freshman","yes",6106555484]
["Rohan","Bhandarkar ","rpb5416","junior","no",2159082441]
["Sunrunyi","Yuan","spy5117","sophmore ","yes",2158534829]
["Ashley","Kniff","ank5452","freshman","no",6313746360]
["Remington","Harris","rgh5122","freshman","no",2674540077]
["Mingyin","Xie","mvx5050","sophomore","yes",9493446685]
["Longhao","Yang","lky5069","sophomore","yes",8143213823]
["Lucas","Richardsen","ljr5433","freshman","yes ",7177363440,"**Also signed in on other computer, paid dues"]
["Mitch","Detwiler","mxd5561","sophmore","no",7178757507]
["Drew","Insley","dki5019","freshman","yes",2678648762]
["Solomon","Szeto","sms8118","freshman","no",9739609726]
["Brian","Garbacik","brg16","freshman","no",6104061219]
["Jiaqi","Lai","jzl38","Junior","yes",8145721987]
["Carmen","Veltri","cpv5095","freshman","yes",4129809383]
["Hanlin","Zhang","hbz5102","freshman","yes",5855001485]
["Haobo","Fan","hmf5251","freshman","yes",9032798635]
["Aidan","Lake","arl5600","soph","nah",6102200141]
["Kabir ","Kohli","kxk338","Junior","Yes",8148265997]
["Matt ","McClintick","mjm7869","Freshman","Yes",6106806171]
["Nicolette","Nybro","nan5101","Sophomore","Yes",7326874697]
["Alexis","Coleman","akc5641","Sophomore","yes",6105853913]
["Maya","DiGirolamo","mvd5783","freshman","yes",4129252885]
["Kyle","Mauger","kjm6235","Sophomore","yes",2672426080]
["Eric ","Zi","gzz5074","freshman","yes",8594575120]
["Kevin","Suryanto","kas7146","junior","yes",6502502840]
["Ethan","Cai","wvc5264","freshman","yes",3392064761]
["Geoffrey","Barratt","gxb92","freshman","yes",6106136597]
["Qiaojuan","Tu","qkt5010","freshman ","yes",8133403112]
["chunxu","wang","ckw5354","freshman","yes",8146991820]
["Matt","Pidgeon","mpp5454","sophomore","yes",8087543561]
["Raymond","Lu","lmr5640","sophomore","yes",7176868750]
["Dante","Marcucci","uum99","freshman","yes",7248096876]
["Kevin","Chow","kbc5228","senior ","yes",7327714111]
["Paul","Birch","pvb5171","Senior","Yes",7245417010]
["Nick ","Mirandi","nxm5386freshman","Fresh","yes",6092766698]
["Bradley","Shafer","bxs437","Soph","yes",6103936774]
["Daniel","Marinelli","dbm5481","Fresh","No",7244138835]
["Beckett","Cromer","bdc5221","Senior","Yes",4125190258]
["Nathan","Newman","ngn5017","Soph","yes",2155898378]
["Nathan","Paisley","nmp5392","Fresh","no",57055605515]
["Kevin","Logan","ktl5134","Soph","yes",3075756544]
["YIDING","WANG","yzw164","Junior","yes",8149549270]
["Zhaoxin","Liang","zxl5305","Junior","yes",7179827984]
["Vince","Birch","vpb5085","Freshman","yes",7245418794]
["Danielle","Jameison","dkj5101","Senior","Yes",4845579427]
["Blake","Rohrbacher","bkr5178","Junior","yes",7248095108]
["justin","Strecker","jxs6288","Junior","yes",7246306993]
["Kody","Allen","kla5319","Junuior","Yes",7178872487]
["Bokai","Chen","bxc59","soph","no",8147776221]
["Anu","Ogunrombi","aso5104","senior","yes",2248755751]
[]
["*Also, David (Chaoyi Zhu I think) paid me his dues.  As did Dante Mariucci and Kevin Chow, but I think they indicated that on their forms.  We'll have to have Noah give us a list of who Venmoed him."]
["*Also, dmb6403@psu.edu wanted added to the listserv."]

{"sheet":"Due Raw","index":31,"n_rows":154,"n_cols":3,"rows_kept":154,"cut":false,"hidden":true,"merged":[]}
["Last Name","First Name","Paid Dues?"]
["Alladi","Shiva","yes"]
["Allen","Kody","yes"]
["Arena","Alex","yes"]
["Aument","Colby","yes"]
["Barratt","Geoffrey","yes"]
["Baurle","Kurt","yes"]
["Bhandarkar","Rohan","no"]
["Birch","Paul","yes"]
["Bromberg","David","no"]
["Cai","Ethan","yes"]
["Cash","Matthew","yes"]
["Chow","Kevin","yes"]
["Chow","Iris","yes"]
["Coleman","Alexis","yes"]
["Collin","O'Connell","yes"]
["Cramer","Myles","no"]
["Cromer","Beckett","yes"]
["Davis","Jennifer","yes"]
["DeMallie","Peter","yes"]
["Detwiler","Mitch","yes"]
["DiGirolamo","Maya","yes"]
["Dolan","Tyler","yes"]
["Dong","Siamio","no"]
["Garbacik","Brian","no"]
["Garcia","Sabrina","yes"]
["Geppert","Taylor","yes"]
["Gibbon","Kara","yes"]
["Glover","Paige","yes"]
["Harris","Remington","no"]
["Hartman","Alex","yes"]
["Hartman","Alex","yes"]
["Haver","Frankie","yes"]
["Hazel","Ryan","yes"]
["Horan","Katherine","no"]
["Howe","Maria","yes"]
["Hughes","Paige","yes"]
["Huth","Kari","yes"]
["Insley","Drew","yes"]
["Jameison","Danielle","yes"]
["Jiang","Yixiao","yes"]
["Kai","Konrad","yes"]
["Kaverman","Joseph","no"]
["Kniff","Ashley","no"]
["Koch","Benjamin","no"]
["Krueger","Konner","yes"]
["Kwon","Ian","no"]
["Lake","Aidan","no"]
["Leon","Anna","no"]
["Liang","Zhaoxin","yes"]
["Liang","Zhiyang","yes"]
["Linkoski","Holly","yes"]
["Liu","Elysia","yes"]
["Logan","Kevin","yes"]
["Lu","Raymond","yes"]
["Marcucci","Dante","yes"]
["Melchiorre","Vince","yes"]
["Mills","Erica","yes"]
["Mirandi","Nick","yes"]
["Newman","Nathan","yes"]
["Niedermayer","Jacob","yes"]
["Ogunrombi","Anu","yes"]
["Paisley","Nathan","no"]
["Pan","Jiasheng","Yes"]
["Parks","Sawyer","no"]
["Perez-Morales","Krystie","yes"]
["Piccari","Thomas","yes"]
["Pidgeon","Matt","yes"]
["Pityk","Ryan","yes"]
["Rausch","Jaccob","yes"]
["Reiter","Jordan","yes"]
["Richardsen","Lucas","yes"]
["Ridenour","Katie","no"]
["roantree","joseph","yes"]
["Rohrbacher","Blake","yes"]
["Scalies","Chris","yes"]
["Semmer","Julia","no"]
["Shafer","Bradley","yes"]
["Smith","Ilsa","no"]
["Steacker","Nikolas","yes"]
["Strecker","Justin","yes"]
["Sukunda","Joseph","No"]
["Sun","Yanan","Yes"]
["Suryanto","Kevin","yes"]
["Szeto","Solomon","no"]
["Tannenbaum","Alexa","yes"]
["Torbert","Michael","no"]
["Trigg","Julia","yes"]
["Tu","Qiaojuan","yes"]
["Veltri","Carmen","yes"]
["Birch","Vince","yes"]
["Voss","Patrick","Yes"]
["Voyack","Ryan","yes"]
["Wagner","Jake","yes"]
["Wang","Yiding","yes"]
["wang","chunxu","yes"]
["Waters","Kelly","yes"]
["Westfall","Greg","yes"]
["Westfall","Kevin","Yes"]
["Wetzel","Morgan","yes"]
["wicker","erin","no"]
["Xie","Mingyin","yes"]
["Yuan","Sunrunyi","yes"]
["Zhu","Chaoyi","yes"]
["Zi","Eric","yes"]
["Andrian","Kevin","yes"]
["Aument","Colby","yes"]
["Barrett","Brooke","yes"]
["Chen","Bokai","yes"]
["Chen","Yuxin","yes"]
["Crawford","Brandon","yes"]
["Dingman","Nick","yes"]
["Fan","Haobo","yes"]
["Felishia","Felishia","yes"]
["Frederick","Ethan","yes"]
["Han","Lily","yes"]
["Johnson","Caroline","yes"]
["Jung","Claudia","yes"]
["Klavans","Sean","yes"]
["Kohli","Kabir","yes"]
["Lai","Vickia","yes"]
["Marinelli","Daniel","yes"]
["Mauger","Kyle","yes"]
["McClintick","Matthew","yes"]
["McStravock","Grace","yes"]
["Mumford","Jon","yes"]
["Nachison","Brent","yes"]
["Nybro","Nicolette","yes"]
["O'Connell","Collin","yes"]
["Patel","Akash","yes"]
["Price","Emily","yes"]
["Stephens","Will","yes"]
["Tan","Mei Ying","yes"]
["West","Kevin","yes"]
["Williams","Jeremy","yes"]
["Wooditch","David","yes"]
["Xia","Vera","yes"]
["Yang","Longhao","yes"]
["Zhang","Hanlin","yes"]
["Han","Zhiyi","yes"]
["Modzelewski","Andrew","yes"]
["Putt","Nathan","yes"]
["Cui","Lisa","yes"]
["Chen","Hoazheng","yes"]
["Yan","Ryan","yes"]
["Liu","Bingxin","yes"]
["Peloro","Christina","yes"]
["Jubran","Yousef","yes"]
["Hsia","Mathilde","yes"]
["Ma","Siyi","yes"]
["Luo","Yu","yes"]
["Zhang","Ruby","yes"]
["Siebert","Allison","yes"]
["Harro","Troy","yes"]

{"sheet":"Dues Look-Up table","index":32,"n_rows":4,"n_cols":24,"rows_kept":4,"cut":false,"hidden":true,"merged":[]}
[null,null,null,null,null,null,null,"This is a lookup table to match a user ID to people who have paid dues",null,null,null,null,null,null,null,null,null,"This is a list of people who paid dues and whos id we have but didn't pay dues at an event so they have to be added to the end of this list"]
[null,null,null,null,null,null,null,"This will need to be updated after each new event (just copy and paste from the home tab"]
[null,null,null,null,null,null,null,"There are issues if someone has paid dues but has not attended any events"]
[null,null,null,null,null,null,null,null,null,null,null,null,null,null,null,null,null,null,null,null,null,null,null,"Michal Roby"]

{"sheet":"Mock Interview Raw Data","index":33,"n_rows":97,"n_cols":5,"rows_kept":97,"cut":false,"hidden":true,"merged":[]}
["Name","Email","First","Last","ID"]
["Allen, Kody","KLA5319@psu.edu",{"$f":"RIGHT(A2,LEN(A2)-FIND(\",\",A2)-1)","v":"Kody"},{"$f":"LEFT(A2,FIND(\",\",A2)-1)","v":"Allen"},{"$f":"LEFT(B2,FIND(\"@\",B2)-1)","v":"KLA5319"}]
["Anderson, Kimberly","KSA5170@psu.edu","Kimberly","Anderson","KSA5170"]
["Arena, Alexander","AFA5399@psu.edu","Alexander","Arena","AFA5399"]
["Azhar, Ahmad Mohd","AQM6158@psu.edu","Ahmad Mohd","Azhar","AQM6158"]
["Beard, Mallory","MMB6124@psu.edu","Mallory","Beard","MMB6124"]
["California, Margot","MAC6866@psu.edu","Margot","California","MAC6866"]
["Carp, Alexis","AMC7067@psu.edu","Alexis","Carp","AMC7067"]
["Chen, Shumin","QUC54@psu.edu","Shumin","Chen","QUC54"]
["Chen, Ying","YMC5189@psu.edu","Ying","Chen","YMC5189"]
["Cherry, Courtney","CLC5887@psu.edu","Courtney","Cherry","CLC5887"]
["Cikowski, Shannon","SPC5519@psu.edu","Shannon","Cikowski","SPC5519"]
["Dalby, Olivia","OPD5013@psu.edu","Olivia","Dalby","OPD5013"]
["Dobransky, Alexis","ALD5655@psu.edu","Alexis","Dobransky","ALD5655"]
["Dougherty, Kyle","KJD5424@psu.edu","Kyle","Dougherty","KJD5424"]
["Feng, Mayting","MUF72@psu.edu","Mayting","Feng","MUF72"]
["Gao, Yang","YUG61@psu.edu","Yang","Gao","YUG61"]
["Gersh, Aaron","ARG5600@psu.edu","Aaron","Gersh","ARG5600"]
["Grawbowski, Connor","ctg5142@psu.edu","Connor","Grawbowski","ctg5142"]
["Guanowsky, Taras","TXG206@psu.edu","Taras","Guanowsky","TXG206"]
["Gupte, Atharv","ABG5424@psu.edu","Atharv","Gupte","ABG5424"]
["Han, Zhiyi","ZVH5145@psu.edu","Zhiyi","Han","ZVH5145"]
["Haridan, Muhamad Hadi","MFH5449@psu.edu","Muhamad Hadi","Haridan","MFH5449"]
["Harro, Troy","TBH5102@psu.edu","Troy","Harro","TBH5102"]
["Haver, Frankie","FPH5023@psu.edu","Frankie","Haver","FPH5023"]
["Hobman, Rebecca","RBH5207@psu.edu","Rebecca","Hobman","RBH5207"]
["Jiang, Yixiao","YXJ38@psu.edu","Yixiao","Jiang","YXJ38"]
["Johnson, Caroline","CRJ5193@psu.edu","Caroline","Johnson","CRJ5193"]
["Jung, Claudia Ho Yan","CJJ5206@psu.edu","Claudia Ho Yan","Jung","CJJ5206"]
["Kahn, Judith","JBK5410@psu.edu","Judith","Kahn","JBK5410"]
["Klavans, Sean","SAK5707@psu.edu","Sean","Klavans","SAK5707"]
["Krueger, Konner","KJK5709@psu.edu","Konner","Krueger","KJK5709"]
["Lai, Jiaqi","JZL38@psu.edu","Jiaqi","Lai","JZL38"]
["Ledven, Mitchell","MRL5449@psu.edu",{"$f":"RIGHT(A34,LEN(A34)-FIND(\",\",A34)-1)","v":"Mitchell"},{"$f":"LEFT(A34,FIND(\",\",A34)-1)","v":"Ledven"},{"$f":"LEFT(B34,FIND(\"@\",B34)-1)","v":"MRL5449"}]
["Li, Hanzhang","HPL5120@psu.edu","Hanzhang","Li","HPL5120"]
["Liu, Heming","HXL335@psu.edu","Heming","Liu","HXL335"]
["Liu, Yixuan","YXL482@psu.edu","Yixuan","Liu","YXL482"]
["Lu, Hao","hfl5046@psu.edu","Hao","Lu","hfl5046"]
["Luo, Jiayu","JZL299@psu.edu","Jiayu","Luo","JZL299"]
["Luo, Xijia","XKL5056@psu.edu","Xijia","Luo","XKL5056"]
["Luo, Yu","YML5242@psu.edu","Yu","Luo","YML5242"]
["Ma, Siyi","SBM5554@psu.edu","Siyi","Ma","SBM5554"]
["Mai, Lang","LUM95@psu.edu","Lang","Mai","LUM95"]
["Malhotra, Twinkle","TZM5406@psu.edu","Twinkle","Malhotra","TZM5406"]
["Mautner Wizentier, Marina","MQM6104@psu.edu","Marina","Mautner Wizentier","MQM6104"]
["Mccormack, Alexandra","AVM5978@psu.edu","Alexandra","Mccormack","AVM5978"]
["Mcstravock, Grace","GVM5232@psu.edu","Grace","Mcstravock","GVM5232"]
["Miller, John","JDM6057@psu.edu","John","Miller","JDM6057"]
["Miller, Nathan","NJM5536@psu.edu","Nathan","Miller","NJM5536"]
["Mo, Chunlan","CXM981@psu.edu","Chunlan","Mo","CXM981"]
["Mohamad Saufi, Iffah","IVM5141@psu.edu","Iffah","Mohamad Saufi","IVM5141"]
["Nachison, Brent","BJN5158@psu.edu","Brent","Nachison","BJN5158"]
["Nguyen, Duong (Willow)","dnn5@psu.edu","Duong (Willow)","Nguyen","dnn5"]
["Niedermayer, Jacob","JTN5161@psu.edu","Jacob","Niedermayer","JTN5161"]
["Parvess, Emma Lee","EMP5462@psu.edu","Emma Lee","Parvess","EMP5462"]
["Pawlikowsky, Kiera","KJP5515@psu.edu","Kiera","Pawlikowsky","KJP5515"]
["Putt, Nathan","NRP5173@psu.edu","Nathan","Putt","NRP5173"]
["Razali, Alia","AUR268@psu.edu","Alia","Razali","AUR268"]
["Reiter, Jordan","JAR6334@psu.edu","Jordan","Reiter","JAR6334"]
["Roby, Michael","MSR5385@psu.edu","Michael","Roby","MSR5385"]
["Rohrbacher, Blake","BKR5178@psu.edu","Blake","Rohrbacher","BKR5178"]
["Seibert, Allison","AZS6047@psu.edu","Allison","Seibert","AZS6047"]
["Shan, Zhengyang","ZJS5170@psu.edu","Zhengyang","Shan","ZJS5170"]
["Shuter, Amanda May","axs6075@psu.edu","Amanda May","Shuter","axs6075"]
["Strecker, Justin","JXS6288@psu.edu","Justin","Strecker","JXS6288"]
["Sudo, Rachel","RBS5427@psu.edu",{"$f":"RIGHT(A66,LEN(A66)-FIND(\",\",A66)-1)","v":"Rachel"},{"$f":"LEFT(A66,FIND(\",\",A66)-1)","v":"Sudo"},{"$f":"LEFT(B66,FIND(\"@\",B66)-1)","v":"RBS5427"}]
["Sui, Helin","HZS58@psu.edu","Helin","Sui","HZS58"]
["Sun, Yanan","YZS70@psu.edu","Yanan","Sun","YZS70"]
["Thompson, Rebekah","RGT5044@psu.edu","Rebekah","Thompson","RGT5044"]
["Tong, Ruxin","RXT26@psu.edu","Ruxin","Tong","RXT26"]
["Van Schaik, Juliette","JIV5171@psu.edu","Juliette","Van Schaik","JIV5171"]
["Wang, Yiding","YZW164@psu.edu","Yiding","Wang","YZW164"]
["Wang, Yuchen","YPW5144@psu.edu","Yuchen","Wang","YPW5144"]
["Wang, Ziming","ZBW5087@psu.edu","Ziming","Wang","ZBW5087"]
["Weber, Rachel","RHW5080@psu.edu","Rachel","Weber","RHW5080"]
["Wiley, Jake","JRW5844@psu.edu","Jake","Wiley","JRW5844"]
["Wilkinson, Conor","CGW5129@psu.edu","Conor","Wilkinson","CGW5129"]
["Wooddell, Zachary","ZTW5052@psu.edu","Zachary","Wooddell","ZTW5052"]
["Xiao, Zhendong","ZPX5023@psu.edu","Zhendong","Xiao","ZPX5023"]
["Xu, Zhengyuan","ZKX5016@psu.edu","Zhengyuan","Xu","ZKX5016"]
["Zhang, Aoshu","AXZ31@psu.edu","Aoshu","Zhang","AXZ31"]
["Zhang, Qin","QFZ5029@psu.edu","Qin","Zhang","QFZ5029"]
["Zhang, Yichi","YXZ362@psu.edu","Yichi","Zhang","YXZ362"]
["Zhang, Zihan","ZUZ161@psu.edu","Zihan","Zhang","ZUZ161"]
["Zuchelli, Nicholas","NQZ5067@psu.edu","Nicholas","Zuchelli","NQZ5067"]
["Trigg, Julia","jxt5423@psu.edu","Julia","Trigg","jxt5423"]
["Wang, Tianhao",null,"Tianhao","Wang","tvw5292"]
["Patel, Akash",null,"Akash","Patel","axp428"]
["Reif, Thomas",null,"Thomas","Reif","tjr5576"]
["Marcucci, Dante",null,"Dante","Marcucci","uum99"]
["Logan, Kevin",null,"Kevin","Logan","ktl5134"]
["Jacob Rausch","jmr6884@psu.edu","Jacob","Rausch","jmr6884"]
["David Wooditch","dmw5806@psu.edu","David","Wooditch","dmw5806"]
["Matt Pidgeon","mpp5454","Matt","Pidgeon","mpp5454"]
["Rohan Bhandakar","rpb5416","Rohan","Bhandarkar","rpb5416"]
["Huiyang Ding","hvd5093","Huiyang","Ding","hvd5093"]
["Kevin Suryanto","kas7146","Kevin","Suryanto","kas7146"]