{"text_format":"1","workbook":"xlsx","n_sheets":34,"sheets":["Student Page","Home","Instructions","Dues","Interview","Event25","Event24","Event23","Event22","Event21","Event20","Event19","Event18","Event17","Event16","Event15","Event14","Event13","Event12","Event11","Event10","Event9","Event8","Event7","Event6","Event5","Event4","Event3","Event2","Event1","Major Forum Roster","Due Raw","Dues Look-Up table","Mock Interview Raw Data"],"not_rendered":{"charts":0,"images":0,"macros":1,"external_links":0,"defined_names":5,"comments":0,"pivot_tables":0},"unopened":[],"bounds":{"document_bytes":16777216,"sheet_cells":100000,"rows_first":2000,"rows_last":500,"rows_between":2000,"halvings":0,"cell_chars":16384,"cell_head_chars":4096},"cells_cut":0,"cells_raw":0,"read":"whole","date_system":"1900"}

{"sheet":"Student Page","index":0,"n_rows":7,"n_cols":2,"rows_kept":7,"cut":false,"hidden":false,"merged":[[1,0,1,2],[2,1,2,2],[3,1,3,2],[0,1,0,2],[7,1,7,2],[6,1,6,2],[4,1,4,2],[5,1,5,2]]}
["Points as of: ",{"$f":"Home!C1","v":"2018-09-21"}]
["Enter your ID (ex. abc1234) to check your points"]
["ID","pvb5171"]
["Points",{"$f":"VLOOKUP(B3, Home!$D:$E, 2, FALSE)","v":7}]
["Dues",{"$f":"VLOOKUP(B3, Home!D:F, 3, FALSE)","v":"Yes"}]
["Mock Interview",{"$f":"VLOOKUP(B3, Home!D:G, 4, FALSE)","v":"N/A"}]
["Next Steps",{"$f":"IF(OR(MONTH(B1)=8, AND(MONTH(B1)=9, DAY(B1)<=17)),\nIF(AND(B4>=2, B5<>\"No\", B6<>\"No\"), Instructions!A11, IF(B4<2, Instructions!A6, \"\") & IF(B5=\"No\", Instructions!B6, \"\") & IF(B6=\"No\", Instructions!C6, \"\") & Instructions!D6),\nIF(OR(B4<2, B5=\"No\", B6=\"No\"), IF(B4<2, Instructions!A7, \"\") & IF(B5=\"No\", Instructions!B7, \"\") & IF(B6=\"No\", Instructions!C7, \"\") & Instructions!D7,\nIF(B4<5, Instructions!A8 & Instructions!D8, IF(B4<10, Instructions!A9 & Instructions!D9, IF(B4<15, Instructions!A10 & Instructions!D10, Instructions!A11)))))","v":"Reach 10 points, allowing you to receive special recognition in resume book beginning spring 2019"}]

{"sheet":"Home","index":1,"n_rows":266,"n_cols":7,"rows_kept":266,"cut":false,"hidden":true,"merged":[]}
["Points Updated as of: ",null,"2018-09-21"]
["Number of events:",null,25]
["Total Members:",null,{"$f":"COUNTA(D8:D1000)","v":259}]
[]
[]
[]
["First","Last","Year","ID","Total","Dues","Mock Interview"]
["Brent","Nachison","Jr","bjn5158",{"$f":"COUNTIF(Event1!$D:$D, D8) + COUNTIF(Event2!$D:$D, D8) + COUNTIF(Event3!$D:$D, D8) + COUNTIF(Event4!$D:$D, D8) + COUNTIF(Event5!$D:$D, D8) + COUNTIF(Event6!$D:$D, D8) + COUNTIF(Event7!$D:$D, D8) + COUNTIF(Event8!$D:$D, D8) + COUNTIF(Event9!$D:$D, D8) + COUNTIF(Event10!$D:$D, D8) + COUNTIF(Event11!$D:$D, D8) + COUNTIF(Event12!$D:$D, D8) + COUNTIF(Event13!$D:$D, D8) + COUNTIF(Event14!$D:$D, D8) + COUNTIF(Event15!$D:$D, D8) + COUNTIF(Event16!$D:$D, D8) + COUNTIF(Event17!$D:$D, D8) + COUNTIF(Event18!$D:$D, D8) + COUNTIF(Event19!$D:$D, D8) + COUNTIF(Event20!$D:$D, D8) + COUNTIF(Event21!$D:$D, D8) + COUNTIF(Event22!$D:$D, D8) + COUNTIF(Event23!$D:$D, D8) + COUNTIF(Event24!$D:$D, D8) + COUNTIF(Event25!$D:$D, D8) + 0","v":16},{"$f":"IF(D8=\"\", \"\", IF(IFERROR(VLOOKUP(D8, Dues!D:D, 1, FALSE), \"\")=\"\", \"No\", \"Yes\"))","v":"Yes"},{"$f":"IF(D8=\"\", \"\", IF(IFERROR(VLOOKUP(D8, Interview!D:D, 1, FALSE), \"\")<>\"\", \"Yes\", IF(OR(C8=\"Fr\", C8=\"So\", AND(C8=\"Sr\", TODAY()<43646)), \"N/A\", \"No\")))","v":"Yes"}]
["Chaoyi","Zhu","Jr","cxz94",{"$f":"COUNTIF(Event1!$D:$D, D9) + COUNTIF(Event2!$D:$D, D9) + COUNTIF(Event3!$D:$D, D9) + COUNTIF(Event4!$D:$D, D9) + COUNTIF(Event5!$D:$D, D9) + COUNTIF(Event6!$D:$D, D9) + COUNTIF(Event7!$D:$D, D9) + COUNTIF(Event8!$D:$D, D9) + COUNTIF(Event9!$D:$D, D9) + COUNTIF(Event10!$D:$D, D9) + COUNTIF(Event11!$D:$D, D9) + COUNTIF(Event12!$D:$D, D9) + COUNTIF(Event13!$D:$D, D9) + COUNTIF(Event14!$D:$D, D9) + COUNTIF(Event15!$D:$D, D9) + COUNTIF(Event16!$D:$D, D9) + COUNTIF(Event17!$D:$D, D9) + COUNTIF(Event18!$D:$D, D9) + COUNTIF(Event19!$D:$D, D9) + COUNTIF(Event20!$D:$D, D9) + COUNTIF(Event21!$D:$D, D9) + COUNTIF(Event22!$D:$D, D9) + COUNTIF(Event23!$D:$D, D9) + COUNTIF(Event24!$D:$D, D9) + COUNTIF(Event25!$D:$D, D9) + 0","v":15},{"$f":"IF(D9=\"\", \"\", IF(IFERROR(VLOOKUP(D9, Dues!D:D, 1, FALSE), \"\")=\"\", \"No\", \"Yes\"))","v":"Yes"},{"$f":"IF(D9=\"\", \"\", IF(IFERROR(VLOOKUP(D9, Interview!D:D, 1, FALSE), \"\")<>\"\", \"Yes\", IF(OR(C9=\"Fr\", C9=\"So\", AND(C9=\"Sr\", TODAY()<43646)), \"N/A\", \"No\")))","v":"No"}]
["Beckett","Cromer","Sr","bdc5221",{"$f":"COUNTIF(Event1!$D:$D, D10) + COUNTIF(Event2!$D:$D, D10) + COUNTIF(Event3!$D:$D, D10) + COUNTIF(Event4!$D:$D, D10) + COUNTIF(Event5!$D:$D, D10) + COUNTIF(Event6!$D:$D, D10) + COUNTIF(Event7!$D:$D, D10) + COUNTIF(Event8!$D:$D, D10) + COUNTIF(Event9!$D:$D, D10) + COUNTIF(Event10!$D:$D, D10) + COUNTIF(Event11!$D:$D, D10) + COUNTIF(Event12!$D:$D, D10) + COUNTIF(Event13!$D:$D, D10) + COUNTIF(Event14!$D:$D, D10) + COUNTIF(Event15!$D:$D, D10) + COUNTIF(Event16!$D:$D, D10) + COUNTIF(Event17!$D:$D, D10) + COUNTIF(Event18!$D:$D, D10) + COUNTIF(Event19!$D:$D, D10) + COUNTIF(Event20!$D:$D, D10) + COUNTIF(Event21!$D:$D, D10) + COUNTIF(Event22!$D:$D, D10) + COUNTIF(Event23!$D:$D, D10) + COUNTIF(Event24!$D:$D, D10) + COUNTIF(Event25!$D:$D, D10) + 0","v":14},{"$f":"IF(D10=\"\", \"\", IF(IFERROR(VLOOKUP(D10, Dues!D:D, 1, FALSE), \"\")=\"\", \"No\", \"Yes\"))","v":"Yes"},{"$f":"IF(D10=\"\", \"\", IF(IFERROR(VLOOKUP(D10, Interview!D:D, 1, FALSE), \"\")<>\"\", \"Yes\", IF(OR(C10=\"Fr\", C10=\"So\", AND(C10=\"Sr\", TODAY()<43646)), \"N/A\", \"No\")))","v":"N/A"}]
{"$rows_left_out":257}
{"sheet":"Instructions","index":2,"n_rows":11,"n_cols":4,"rows_kept":11,"cut":false,"hidden":true,"merged":[[1,0,1,12]]}
["Operation instructions:"]
["- Enter new events on new sheets.  Make a new sheet by copying an old sheet and renaming it Eventx, where x is the next sequential event number.\n- Specify each event's name and date.  Attendance will autofill.\n- Check that no one entered their full email address in the ID field.  Also check that class standings are all in the correct abbreviations.\n- Before updating points, make sure to enter the date you are updating and the total number of events that are being counted in the yellow area at the top."]
[]
[]
["Levels"]
["Reach 2 points, ","Pay dues, ","Do a Mock Interview, ","and do this by the career fair to be in October resume book and be considered club member"]
["Reach 2 points, ","Pay dues, ","Do a Mock Interview, ","and as soon as you do you can be in the resume book and be considered a club member"]
["Reach 5 points, ","Pay dues, ","Do a Mock Interview, ","allowing you to be in resume book in September 2019 (you're eligible for the resume book until then)"]
["Reach 10 points, ","Pay dues, ","Do a Mock Interview, ","allowing you to receive special recognition in resume book beginning spring 2019"]
["Reach 15 points, ","Pay dues, ","Do a Mock Interview, ","allowing you to qualify for special networking event in fall 2019"]
{"$rows_left_out":2}
{"sheet":"Dues","index":3,"n_rows":643,"n_cols":4,"rows_kept":643,"cut":false,"hidden":true,"merged":[]}
["Event: ","Dues"]
["Date:","2018-09-22","<- Date last updated"]
["Attendance:",{"$f":"COUNTA(D6:D499)","v":170}]
[]
["First","Last","Year","ID"]
["Shiva","Alladi","Sr","ssa5254"]
["Kody","Allen","Jr","kla5319"]
["Alex","Arena","Jr","afa5399"]
["Colby","Aument","Fr","cga5095"]
["Geoffrey","Barratt","Fr","gxb92"]
{"$rows_left_out":634}
{"sheet":"Interview","index":4,"n_rows":101,"n_cols":4,"rows_kept":101,"cut":false,"hidden":true,"merged":[]}
["Event: ","Mock Interview"]
["Date:","2018-09-03"]
["Attendance:",{"$f":"COUNTA(D6:D206)","v":96}]
[]
["First","Last","Year","ID"]
["Kody","Allen","Jr","KLA5319"]
["Kimberly","Anderson","Jr","KSA5170"]
["Alexander","Arena","Jr","AFA5399"]
["Ahmad Mohd","Azhar","Jr","AQM6158"]
["Mallory","Beard","Jr","MMB6124"]
{"$rows_left_out":92}
{"sheet":"Event25","index":5,"n_rows":20,"n_cols":4,"rows_kept":20,"cut":false,"hidden":true,"merged":[]}
["Event:","Erie Insurance"]
["Date:","2018-09-17"]
["Attendance:",15]
[]
["First Name","Last Name","Year","PSU ID (ex. abc1234)"]
["Chaoyi","Zhu","Jr","cxz94"]
["Atharv","Gupte","Jr","abg5424"]
["tingting","wu","Sr","tbw5119"]
["Brent","Nachison","Jr","bjn5158"]
["Marceli","Palikowski","So","mzp5569"]
{"$rows_left_out":11}
{"sheet":"Event24","index":6,"n_rows":23,"n_cols":4,"rows_kept":23,"cut":false,"hidden":true,"merged":[]}
["Event:","NYL"]
["Date:","2018-09-17"]
["Attendance:",18]
[]
["First Name","Last Name","Year","PSU ID (ex. abc1234)"]
["Dante","Marcucci","So","uum99"]
["Yu","Luo","Jr","yml5242"]
["Mei Ying","Tan","Sr","mut77"]
["Akram","Khan","Sr","ayk5511"]
["John","Miller","Jr","jdm6057"]
{"$rows_left_out":14}
{"sheet":"Event23","index":7,"n_rows":13,"n_cols":4,"rows_kept":13,"cut":false,"hidden":true,"merged":[]}
["Event:","Lunch with Leaders"]
["Date:","2018-09-14"]
["Attendance:",{"$f":"COUNTA(B6:B30)","v":8}]
[]
["First Name","Last Name","Year","PSU ID (ex. abc1234)"]
["Nicke","Mirandi","Fr","nxm5386"]
["Zhengyan","Yuan","Jr","zqy5133"]
["Marko","Resetar","Sr","mvr5349"]
["Qin","Zhang","Jr","qfz5029"]
["Gary","Modzelewski","Jr","gam5292"]
{"$rows_left_out":4}
{"sheet":"Event22","index":8,"n_rows":30,"n_cols":4,"rows_kept":30,"cut":false,"hidden":true,"merged":[]}
["Event:","Aon Info Session"]
["Date:","2018-09-17"]
["Attendance:",{"$f":"COUNTA(B6:B30)","v":25}]
[]
["First Name","Last Name","Year","PSU ID (ex. abc1234)"]
["Ethan","Frederick","Sr","esf5093"]
["Joe","Esch","Sr","jze5187"]
["Brent","Nachison","Jr","bjn5158"]
["Judy","Kahn","Jr","jbk5410"]
["Margot","California","Jr","mac6866"]
{"$rows_left_out":21}
{"sheet":"Event21","index":9,"n_rows":23,"n_cols":4,"rows_kept":23,"cut":false,"hidden":true,"merged":[]}
["Event:","Ernst & Young"]
["Date:","2018-08-17"]
["Attendance:",18]
[]
["First Name","Last Name","Year","PSU ID (ex. abc1234)"]
["Matthew","Pidgeon","So","mpp5454"]
["Akram","Khan","Sr","ayk5511"]
["Taras","Guanowsky","Jr","txg206"]
["Marceli","Pawlikowski","So","mzp5569"]
["Brooke","Barrett","Sr","blb5681"]
{"$rows_left_out":14}
{"sheet":"Event20","index":10,"n_rows":25,"n_cols":4,"rows_kept":25,"cut":false,"hidden":true,"merged":[]}
["Event:","Oliver Wyman"]
["Date:","2018-09-12"]
["Attendance:",{"$f":"COUNTA(D6:D206)","v":20}]
[]
["First Name","Last Name","Year","PSU ID (ex. abc1234)"]
["Lisa","Winters","Sr","lvw5155"]
["Mike","Callahan","Sr","mgc5166"]
["Ryan",null,"Sr","rjv5140"]
["Aaron","Gersh","Jr","arg5600"]
["Michael","Roby","Jr","msr5385"]
{"$rows_left_out":16}
{"sheet":"Event19","index":11,"n_rows":45,"n_cols":4,"rows_kept":45,"cut":false,"hidden":true,"merged":[]}
["Event:","Aetna Info Session"]
["Date:","2018-09-12"]
["Attendance:",{"$f":"COUNTA(D6:D206)","v":40}]
[]
["First Name","Last Name","Year","PSU ID (ex. abc1234)"]
["Paul","Birch","Sr","pvb5171"]
["Atharv","Gupte","Jr","abg5424"]
["Caroline","Johnson","Jr","crj5193"]
["Courtney ","Cherry","Jr","clc5887"]
["Elizabeth","Simmons","Jr","ems6139"]
{"$rows_left_out":36}
{"sheet":"Event18","index":12,"n_rows":36,"n_cols":4,"rows_kept":36,"cut":false,"hidden":true,"merged":[]}
["Event:","Deloitte Info Session"]
["Date:","2018-09-16"]
["Attendance:",31]
[]
["First Name","Last Name","Year","PSU ID (ex. abc1234)"]
["Matthew","Pidgeon","So","mpp5454"]
["Amanda","Shuter","So","axs6075"]
["May","Feng","Jr","muf72"]
["Aaron","Gersh","Jr","arg5600"]
["Rachel","Weber","Jr","rhw5080"]
{"$rows_left_out":27}
{"sheet":"Event17","index":13,"n_rows":22,"n_cols":4,"rows_kept":22,"cut":false,"hidden":true,"merged":[]}
["Event:","KPMG"]
["Date:","2018-09-16"]
["Attendance:",17]
[]
["First Name","Last Name","Year","PSU ID (ex. abc1234)"]
["Mingzhang","Yan","Sr","mxy5097"]
["Beckett","Cromer","Sr","bdc5221"]
["Chaoyi","Zhu","Jr","cxz94"]
["Allison ","Seibert","Jr","azs6047"]
["Nicolette","Nybro","So","nan5101"]
{"$rows_left_out":13}
{"sheet":"Event16","index":14,"n_rows":36,"n_cols":4,"rows_kept":36,"cut":false,"hidden":true,"merged":[]}
["Event:","IBX Info Session"]
["Date:","2018-09-16"]
["Attendance:",31]
[]
["First Name","Last Name","Year","PSU ID (ex. abc1234)"]
["huiyang","ding","Sr","hvd5093"]
["Michael","Gordon","Sr","mjg5847"]
["Erica","Mills","So","ekm5337"]
["Ashley","Morris","Sr","alm6239"]
["Emily","Price","Sr","emp5391"]
{"$rows_left_out":27}
{"sheet":"Event15","index":15,"n_rows":26,"n_cols":4,"rows_kept":26,"cut":false,"hidden":true,"merged":[]}
["Event:","Wakely"]
["Date:","2018-09-16"]
["Attendance:",21]
[]
["First Name","Last Name","Year","PSU ID (ex. abc1234)"]
["Brent","Nachison","Jr","bjn5158"]
["Michael","Roby","Jr","msr5385"]
["Qin","Zhang","Jr","qfz5029"]
["Alexis","Lasko","Jr","all5680"]
["Mallory","Beard","Jr","mmb6124"]
{"$rows_left_out":17}
{"sheet":"Event14","index":16,"n_rows":78,"n_cols":4,"rows_kept":78,"cut":false,"hidden":true,"merged":[]}
["Event:","Cigna Info Session"]
["Date:","2018-09-16"]
["Attendance:",73]
[]
["First Name","Last Name","Year","PSU ID (ex. abc1234)"]
["Paul","Birch","Sr","pvb5171"]
["Jiaqi","Lai","Jr","jzl38"]
["Nathan","Miller","Jr","njm5536"]
["Harro","Troy","Jr","tbh5102"]
["Felishia","Felishia","So","ffn5018"]
{"$rows_left_out":69}
{"sheet":"Event13","index":17,"n_rows":57,"n_cols":4,"rows_kept":57,"cut":false,"hidden":true,"merged":[]}
["Event:","Prudential "]
["Date:","2018-09-16"]
["Attendance:",{"$f":"COUNTA(B6:B57)","v":52}]
[]
["First Name","Last Name","Year","PSU ID (ex. abc1234)"]
["Kyle","Mauger","So","kjm6235"]
["Cristina","Peloro","Fr","czp5434"]
["Rachel","Weber","Jr","rhw5080"]
["Bradley","Shafer","So","bxs437"]
["Joe","Esch","Sr","jze5187"]
{"$rows_left_out":48}
{"sheet":"Event12","index":18,"n_rows":54,"n_cols":4,"rows_kept":54,"cut":false,"hidden":true,"merged":[]}
["Event:","Highmark Health"]
["Date:","2018-09-16"]
["Attendance:",49]
[]
["First Name","Last Name","Year","PSU ID (ex. abc1234)"]
["Jeremy","Williams","Jr","jsw5439"]
["Marko","Resetar","Sr","mvr5349"]
["Patrick","Voss","Fr","puv44"]
["Raymond","Lu","So","lmr5640"]
["Jonathan","Mumford","So","jbm5733"]
{"$rows_left_out":45}
{"sheet":"Event11","index":19,"n_rows":56,"n_cols":4,"rows_kept":56,"cut":false,"hidden":true,"merged":[]}
["Event:","WTW"]
["Date:","2018-09-16"]
["Attendance:",51]
[]
["First Name","Last Name","Year","PSU ID (ex. abc1234)"]
["Erica","Mills","So","ekm5337"]
["Qin","Zhang","Jr","qfz5029"]
["Siyi","Ma","Jr","sbm5554"]
["Chaoyi","Zhu","Jr","cxz94"]
["Ryan","Hazel","So","rxh378"]
{"$rows_left_out":47}
{"sheet":"Event10","index":20,"n_rows":22,"n_cols":4,"rows_kept":22,"cut":false,"hidden":true,"merged":[]}
["Event:","GAFG Info Session"]
["Date:","2018-09-11"]
["Attendance:",{"$f":"COUNTA(D6:D206)","v":17}]
[]
["First Name","Last Name","Year","PSU ID (ex. abc1234)"]
["Mingzhang","Yan","Sr","mxy5097"]
["Joseph","Sukunda","Sr","jhs5325"]
["Chaoyi","Zhu","Jr","cxz94"]
["Julia","Trgg","So","jxt5423"]
["Joshua","Goldstein","Sr","jjg5636"]
{"$rows_left_out":13}
{"sheet":"Event9","index":21,"n_rows":15,"n_cols":4,"rows_kept":15,"cut":false,"hidden":true,"merged":[]}
["Event:","Lunch with Leaders"]
["Date:","2018-09-07"]
["Attendance:",{"$f":"COUNTA(D6:D206)","v":10}]
[]
["First Name","Last Name","Year","PSU ID (ex. abc1234)"]
["Cristina","Peloro","Fr","czp5434"]
["Yousef","Jubran","Sr","ynj5007"]
["Thomas","Iliou","So","txi5033"]
["Chris","Scalies","Fr","cjs6819"]
["Tsz Yau Iris","Chow","Fr","tfc5229"]
{"$rows_left_out":6}
{"sheet":"Event8","index":22,"n_rows":29,"n_cols":4,"rows_kept":29,"cut":false,"hidden":true,"merged":[]}
["Event:","International Student Meeting"]
["Date:","2018-09-05"]
["Attendance:",{"$f":"COUNTA(D6:D206)","v":24}]
[]
["First Name","Last Name","Year","PSU ID (ex. abc1234)"]
["Paul","Birch","Sr","pvb5171"]
["Vera","Xia","Sr","xzx5081"]
["Yuxin","Chen","So","ymc5216"]
["Jiasheng","Pan","Jr","jmp6546"]
["Kabir","Kohli","Jr","kxk338"]
{"$rows_left_out":20}
{"sheet":"Event7","index":23,"n_rows":33,"n_cols":4,"rows_kept":33,"cut":false,"hidden":true,"merged":[]}
["Event:","R Session 2"]
["Date:","2018-09-04"]
["Attendance:",28]
[]
["First Name","Last Name","Year","PSU ID (ex. abc1234)"]
["Brent","Nachison","Jr","bjn5158"]
["Connor","Grabowski","Jr","ctg5142"]
["Kelly","Waters","So","kfw5153"]
["Jiali","Liu","Sr","jul551"]
["Vince","Melchiorre","Fr","vzm35"]
{"$rows_left_out":24}
{"sheet":"Event6","index":24,"n_rows":47,"n_cols":4,"rows_kept":47,"cut":false,"hidden":true,"merged":[]}
["Event:","Resume Review"]
["Date:","2018-08-30"]
["Attendance:",{"$f":"COUNTA(D6:D206)","v":42}]
[]
["First Name","Last Name","Year","PSU ID (ex. abc1234)"]
["Liam","Richards","Sr","lrr5177"]
["Andrew","Modzelewski","Jr","gam5292"]
["Beckett","Cromer","Sr","bdc5221"]
["Lu","Huang","Jr","lph5179"]
["Yixiao","Jiang","Jr","yxj38"]
{"$rows_left_out":38}
{"sheet":"Event5","index":25,"n_rows":15,"n_cols":4,"rows_kept":15,"cut":false,"hidden":true,"merged":[]}
["Event:","Commonwealth Student Meeting"]
["Date:","2018-08-29"]
["Attendance:",{"$f":"COUNTA(D6:D206)","v":10}]
[]
["First Name","Last Name","Year","PSU ID (ex. abc1234)"]
["Paul","Birch","Sr","pvb5171"]
["Konner","Krueger","Jr","kjk5709"]
["Kelly","Waters","Jr","kfw5153"]
["Jingzhe","Han","Jr","jjh6271"]
["YIDIND","WANG","Jr","yzw164"]
{"$rows_left_out":6}
{"sheet":"Event4","index":26,"n_rows":20,"n_cols":4,"rows_kept":20,"cut":false,"hidden":true,"merged":[]}
["Event:","Geico Info Session"]
["Date:","2018-08-29"]
["Attendance:",{"$f":"COUNTA(D6:D206)","v":15}]
[]
["First Name","Last Name","Year","PSU ID (ex. abc1234)"]
["Brent","Nachison","Jr","bjn5158"]
["Connor","Grabowski","Jr","ctg5142"]
["Alyssa","Lombardo","Sr","ajl5753"]
["Alexandra","Stiles","Sr","als6468"]
["Joseph","Sukunda","Sr","jhs5325"]
{"$rows_left_out":11}
{"sheet":"Event3","index":27,"n_rows":35,"n_cols":4,"rows_kept":35,"cut":false,"hidden":true,"merged":[]}
["Event: ","R Session 1"]
["Date:","2018-08-28"]
["Attendance:",{"$f":"COUNTA(D6:D206)","v":30}]
[]
["First Name","Last Name","Year","PSU ID (ex. abc1234)"]
["Brent","Nachison","Jr","bjn5158"]
["Nathan","Putt","Jr","nrp5173"]
["Rachel","Weber","Jr","rhw5080"]
["Connor","Grabowski","Jr","ctg5142"]
["Krystie","Perez","So","knp5260"]
{"$rows_left_out":26}
{"sheet":"Event2","index":28,"n_rows":80,"n_cols":4,"rows_kept":80,"cut":false,"hidden":true,"merged":[]}
["Event:","Resume/Interview Workshop"]
["Date:","2018-08-27"]
["Attendance:",{"$f":"COUNTA(D6:D206)","v":75}]
[]
["First Name","Last Name","Year","PSU ID (ex. abc1234)"]
["Paul","Birch","Sr","pvb5171"]
["Mitch","Detwiler","So","mxd5561"]
["Taylor ","Geppert ","Fr","stg5184"]
["David","Wooditch","Jr","dmw5806"]
["Lucas","Richardsen","Fr","ljr5433"]
{"$rows_left_out":71}
{"sheet":"Event1","index":29,"n_rows":118,"n_cols":4,"rows_kept":118,"cut":false,"hidden":true,"merged":[]}
["Event: ","Major Forum"]
["Date:","2018-08-23"]
["Attendance:",{"$f":"COUNTA(D6:D206)","v":113}]
[]
["First","Last","Year","ID"]
["Joseph","Sukunda","Sr","jhs5325"]
["Katherine","Horan","Fr","kjh5927"]
["Chaoyi","Zhu","Jr","cxz94"]
["David","Wooditch","Jr","dmw5806"]
["Nick","Dingman","Fr","nvd5236"]
{"$rows_left_out":109}
{"sheet":"Major Forum Roster","index":30,"n_rows":114,"n_cols":7,"rows_kept":114,"cut":false,"hidden":true,"merged":[]}
["8/23/2018 Act. Sci. Major Forum Sign-In"]
[]
["First","Last","PSU ID","Year","Paid Dues?","Phone Number (to be added in GroupMe)"]
["Joseph","Sukunda","jhs5325","Senior","No"]
["Katherine","Horan","kjh5927","Freshman","No"]
["Chaoyi","Zhu","cxz94","Junior","No"]
["David","Wooditch","dmw5806","Junior","No","(717) 378-1101"]
["Nick","Dingman","nvd5236","freshman","no",3154093849]
["Kara","Gibbon","kxg295","freshman","No","724-549-7466"]
["Anna","Leon","ajl6225","freshman","no",2673721364]
{"$rows_left_out":105}
{"sheet":"Due Raw","index":31,"n_rows":154,"n_cols":3,"rows_kept":154,"cut":false,"hidden":true,"merged":[]}
["Last Name","First Name","Paid Dues?"]
["Alladi","Shiva","yes"]
["Allen","Kody","yes"]
["Arena","Alex","yes"]
["Aument","Colby","yes"]
["Barratt","Geoffrey","yes"]
["Baurle","Kurt","yes"]
["Bhandarkar","Rohan","no"]
["Birch","Paul","yes"]
["Bromberg","David","no"]
{"$rows_left_out":145}
{"sheet":"Dues Look-Up table","index":32,"n_rows":4,"n_cols":24,"rows_kept":4,"cut":false,"hidden":true,"merged":[]}
[null,null,null,null,null,null,null,"This is a lookup table to match a user ID to people who have paid dues",null,null,null,null,null,null,null,null,null,"This is a list of people who paid dues and whos id we have but didn't pay dues at an event so they have to be added to the end of this list"]
[null,null,null,null,null,null,null,"This will need to be updated after each new event (just copy and paste from the home tab"]
[null,null,null,null,null,null,null,"There are issues if someone has paid dues but has not attended any events"]
[null,null,null,null,null,null,null,null,null,null,null,null,null,null,null,null,null,null,null,null,null,null,null,"Michal Roby"]

{"sheet":"Mock Interview Raw Data","index":33,"n_rows":97,"n_cols":5,"rows_kept":97,"cut":false,"hidden":true,"merged":[]}
["Name","Email","First","Last","ID"]
["Allen, Kody","KLA5319@psu.edu",{"$f":"RIGHT(A2,LEN(A2)-FIND(\",\",A2)-1)","v":"Kody"},{"$f":"LEFT(A2,FIND(\",\",A2)-1)","v":"Allen"},{"$f":"LEFT(B2,FIND(\"@\",B2)-1)","v":"KLA5319"}]
["Anderson, Kimberly","KSA5170@psu.edu","Kimberly","Anderson","KSA5170"]
["Arena, Alexander","AFA5399@psu.edu","Alexander","Arena","AFA5399"]
["Azhar, Ahmad Mohd","AQM6158@psu.edu","Ahmad Mohd","Azhar","AQM6158"]
["Beard, Mallory","MMB6124@psu.edu","Mallory","Beard","MMB6124"]
["California, Margot","MAC6866@psu.edu","Margot","California","MAC6866"]
["Carp, Alexis","AMC7067@psu.edu","Alexis","Carp","AMC7067"]
["Chen, Shumin","QUC54@psu.edu","Shumin","Chen","QUC54"]
["Chen, Ying","YMC5189@psu.edu","Ying","Chen","YMC5189"]
{"$rows_left_out":87}